{"text_format":"1","workbook":"xlsx","n_sheets":5,"sheets":["Produktionsanlæg","Distributionsanlæg","Fællesfunktionsanlæg","Genanskaffelsespriser","Priser"],"not_rendered":{"charts":13,"images":3,"macros":1,"external_links":0,"defined_names":8,"comments":0,"pivot_tables":0},"unopened":[],"bounds":{"document_bytes":16777216,"sheet_cells":100000,"rows_first":2000,"rows_last":500,"rows_between":2000,"halvings":0,"cell_chars":16384,"cell_head_chars":4096},"cells_cut":0,"cells_raw":0,"read":"whole","date_system":"1900"}

{"sheet":"Produktionsanlæg","index":0,"n_rows":197,"n_cols":10,"rows_kept":197,"cut":false,"hidden":false,"merged":[]}
["PRODUKTIONSANLÆG","Enhed","Standardlevetid","Mængde","Enhedspris","Samlet værdi","Afskrivning",null,"Postnr.","Samlede afskrivninger"]
["Boringer",null,null,null,null,null,null,null,0,{"$f":"SUM(G:G,Distributionsanlæg!G:G,Fællesfunktionsanlæg!G:G)","v":0}]
["Boring (inkl. etablering, forerør, filter og prøvepumpning)","dybdemeter",{"$f":"Genanskaffelsespriser!E5","v":30},0,{"$f":"Genanskaffelsespriser!$D5","v":2538},{"$f":"D3*E3","v":0},{"$f":"F3/C3","v":0}]
["Råvandsstationer"]
["Råvandsstation komplet montering og boringshus/tørbrønd","stk.",{"$f":"Genanskaffelsespriser!E7","v":30},0,{"$f":"Genanskaffelsespriser!$D7","v":57810},{"$f":"D5*E5","v":0},{"$f":"F5/C5","v":0}]
["Instrumenter (flowmåler+tryk transducer+alarmer)","stk.",{"$f":"Genanskaffelsespriser!E8","v":10},0,{"$f":"Genanskaffelsespriser!$D8","v":65241},{"$f":"D6*E6","v":0},0]
["Pumpe inkl. stigrør og forerørsforsejlinger mv. 1","m³/h ",{"$f":"Genanskaffelsespriser!E9","v":15},0,{"$f":"IF(COUNTIF(D7:D7,\"<>0\")<=1,IF((SUM(D7:D7))=0,0,(+HLOOKUP((SUM(D7:D7)),Priser!$E$54:$J$56,2)+((SUM(D7:D7))-HLOOKUP((SUM(D7:D7)),Priser!$E$54:$J$56,1))*HLOOKUP((SUM(D7:D7)),Priser!$E$54:$J$56,3))/(SUM(D7:D7)))*(1+Genanskaffelsespriser!$D$196),\"Fejl\")","v":0},{"$f":"D7*E7","v":0},0]
["Pumpe inkl. stigrør og forerørsforsejlinger mv. 2","m³/h ",{"$f":"Genanskaffelsespriser!E9","v":15},0,{"$f":"IF(COUNTIF(D8:D8,\"<>0\")<=1,IF((SUM(D8:D8))=0,0,(+HLOOKUP((SUM(D8:D8)),Priser!$E$54:$J$56,2)+((SUM(D8:D8))-HLOOKUP((SUM(D8:D8)),Priser!$E$54:$J$56,1))*HLOOKUP((SUM(D8:D8)),Priser!$E$54:$J$56,3))/(SUM(D8:D8)))*(1+Genanskaffelsespriser!$D$196),\"Fejl\")","v":0},{"$f":"D8*E8","v":0},0]
["Pumpe inkl. stigrør og forerørsforsejlinger mv. 3","m³/h ",{"$f":"Genanskaffelsespriser!E9","v":15},0,{"$f":"IF(COUNTIF(D9:D9,\"<>0\")<=1,IF((SUM(D9:D9))=0,0,(+HLOOKUP((SUM(D9:D9)),Priser!$E$54:$J$56,2)+((SUM(D9:D9))-HLOOKUP((SUM(D9:D9)),Priser!$E$54:$J$56,1))*HLOOKUP((SUM(D9:D9)),Priser!$E$54:$J$56,3))/(SUM(D9:D9)))*(1+Genanskaffelsespriser!$D$196),\"Fejl\")","v":0},0,0]
["Pumpe inkl. stigrør og forerørsforsejlinger mv. 4","m³/h ",{"$f":"Genanskaffelsespriser!E9","v":15},0,{"$f":"IF(COUNTIF(D10:D10,\"<>0\")<=1,IF((SUM(D10:D10))=0,0,(+HLOOKUP((SUM(D10:D10)),Priser!$E$54:$J$56,2)+((SUM(D10:D10))-HLOOKUP((SUM(D10:D10)),Priser!$E$54:$J$56,1))*HLOOKUP((SUM(D10:D10)),Priser!$E$54:$J$56,3))/(SUM(D10:D10)))*(1+Genanskaffelsespriser!$D$196),\"Fejl\")","v":0},0,0]
["Pumpe inkl. stigrør og forerørsforsejlinger mv. 5","m³/h ",{"$f":"Genanskaffelsespriser!E9","v":15},0,{"$f":"IF(COUNTIF(D11:D11,\"<>0\")<=1,IF((SUM(D11:D11))=0,0,(+HLOOKUP((SUM(D11:D11)),Priser!$E$54:$J$56,2)+((SUM(D11:D11))-HLOOKUP((SUM(D11:D11)),Priser!$E$54:$J$56,1))*HLOOKUP((SUM(D11:D11)),Priser!$E$54:$J$56,3))/(SUM(D11:D11)))*(1+Genanskaffelsespriser!$D$196),\"Fejl\")","v":0},0,0]
["Pumpe inkl. stigrør og forerørsforsejlinger mv. 6","m³/h ",{"$f":"Genanskaffelsespriser!E9","v":15},0,{"$f":"IF(COUNTIF(D12:D12,\"<>0\")<=1,IF((SUM(D12:D12))=0,0,(+HLOOKUP((SUM(D12:D12)),Priser!$E$54:$J$56,2)+((SUM(D12:D12))-HLOOKUP((SUM(D12:D12)),Priser!$E$54:$J$56,1))*HLOOKUP((SUM(D12:D12)),Priser!$E$54:$J$56,3))/(SUM(D12:D12)))*(1+Genanskaffelsespriser!$D$196),\"Fejl\")","v":0},0,0]
["Pumpe inkl. stigrør og forerørsforsejlinger mv. 7","m³/h ",{"$f":"Genanskaffelsespriser!E9","v":15},0,{"$f":"IF(COUNTIF(D13:D13,\"<>0\")<=1,IF((SUM(D13:D13))=0,0,(+HLOOKUP((SUM(D13:D13)),Priser!$E$54:$J$56,2)+((SUM(D13:D13))-HLOOKUP((SUM(D13:D13)),Priser!$E$54:$J$56,1))*HLOOKUP((SUM(D13:D13)),Priser!$E$54:$J$56,3))/(SUM(D13:D13)))*(1+Genanskaffelsespriser!$D$196),\"Fejl\")","v":0},0,0]
["Pumpe inkl. stigrør og forerørsforsejlinger mv. 8","m³/h ",{"$f":"Genanskaffelsespriser!E9","v":15},0,{"$f":"IF(COUNTIF(D14:D14,\"<>0\")<=1,IF((SUM(D14:D14))=0,0,(+HLOOKUP((SUM(D14:D14)),Priser!$E$54:$J$56,2)+((SUM(D14:D14))-HLOOKUP((SUM(D14:D14)),Priser!$E$54:$J$56,1))*HLOOKUP((SUM(D14:D14)),Priser!$E$54:$J$56,3))/(SUM(D14:D14)))*(1+Genanskaffelsespriser!$D$196),\"Fejl\")","v":0},0,0]
["Pumpe inkl. stigrør og forerørsforsejlinger mv. 9","m³/h ",{"$f":"Genanskaffelsespriser!E9","v":15},0,{"$f":"IF(COUNTIF(D15:D15,\"<>0\")<=1,IF((SUM(D15:D15))=0,0,(+HLOOKUP((SUM(D15:D15)),Priser!$E$54:$J$56,2)+((SUM(D15:D15))-HLOOKUP((SUM(D15:D15)),Priser!$E$54:$J$56,1))*HLOOKUP((SUM(D15:D15)),Priser!$E$54:$J$56,3))/(SUM(D15:D15)))*(1+Genanskaffelsespriser!$D$196),\"Fejl\")","v":0},0,0]
["Pumpe inkl. stigrør og forerørsforsejlinger mv. 10","m³/h ",15,0,{"$f":"IF(COUNTIF(D16:D16,\"<>0\")<=1,IF((SUM(D16:D16))=0,0,(+HLOOKUP((SUM(D16:D16)),Priser!$E$54:$J$56,2)+((SUM(D16:D16))-HLOOKUP((SUM(D16:D16)),Priser!$E$54:$J$56,1))*HLOOKUP((SUM(D16:D16)),Priser!$E$54:$J$56,3))/(SUM(D16:D16)))*(1+Genanskaffelsespriser!$D$196),\"Fejl\")","v":0},0,0]
["Pumpe inkl. stigrør og forerørsforsejlinger mv. 11","m³/h ",15,0,{"$f":"IF(COUNTIF(D17:D17,\"<>0\")<=1,IF((SUM(D17:D17))=0,0,(+HLOOKUP((SUM(D17:D17)),Priser!$E$54:$J$56,2)+((SUM(D17:D17))-HLOOKUP((SUM(D17:D17)),Priser!$E$54:$J$56,1))*HLOOKUP((SUM(D17:D17)),Priser!$E$54:$J$56,3))/(SUM(D17:D17)))*(1+Genanskaffelsespriser!$D$196),\"Fejl\")","v":0},0,0]
["Pumpe inkl. stigrør og forerørsforsejlinger mv. 12","m³/h ",15,0,{"$f":"IF(COUNTIF(D18:D18,\"<>0\")<=1,IF((SUM(D18:D18))=0,0,(+HLOOKUP((SUM(D18:D18)),Priser!$E$54:$J$56,2)+((SUM(D18:D18))-HLOOKUP((SUM(D18:D18)),Priser!$E$54:$J$56,1))*HLOOKUP((SUM(D18:D18)),Priser!$E$54:$J$56,3))/(SUM(D18:D18)))*(1+Genanskaffelsespriser!$D$196),\"Fejl\")","v":0},0,0]
["Pumpe inkl. stigrør og forerørsforsejlinger mv. 13","m³/h ",15,0,{"$f":"IF(COUNTIF(D19:D19,\"<>0\")<=1,IF((SUM(D19:D19))=0,0,(+HLOOKUP((SUM(D19:D19)),Priser!$E$54:$J$56,2)+((SUM(D19:D19))-HLOOKUP((SUM(D19:D19)),Priser!$E$54:$J$56,1))*HLOOKUP((SUM(D19:D19)),Priser!$E$54:$J$56,3))/(SUM(D19:D19)))*(1+Genanskaffelsespriser!$D$196),\"Fejl\")","v":0},0,0]
["Pumpe inkl. stigrør og forerørsforsejlinger mv. 14","m³/h ",15,0,{"$f":"IF(COUNTIF(D20:D20,\"<>0\")<=1,IF((SUM(D20:D20))=0,0,(+HLOOKUP((SUM(D20:D20)),Priser!$E$54:$J$56,2)+((SUM(D20:D20))-HLOOKUP((SUM(D20:D20)),Priser!$E$54:$J$56,1))*HLOOKUP((SUM(D20:D20)),Priser!$E$54:$J$56,3))/(SUM(D20:D20)))*(1+Genanskaffelsespriser!$D$196),\"Fejl\")","v":0},0,0]
["Pumpe inkl. stigrør og forerørsforsejlinger mv. 15","m³/h ",15,0,{"$f":"IF(COUNTIF(D21:D21,\"<>0\")<=1,IF((SUM(D21:D21))=0,0,(+HLOOKUP((SUM(D21:D21)),Priser!$E$54:$J$56,2)+((SUM(D21:D21))-HLOOKUP((SUM(D21:D21)),Priser!$E$54:$J$56,1))*HLOOKUP((SUM(D21:D21)),Priser!$E$54:$J$56,3))/(SUM(D21:D21)))*(1+Genanskaffelsespriser!$D$196),\"Fejl\")","v":0},0,0]
["Pumpe inkl. stigrør og forerørsforsejlinger mv. 16","m³/h ",15,0,{"$f":"IF(COUNTIF(D22:D22,\"<>0\")<=1,IF((SUM(D22:D22))=0,0,(+HLOOKUP((SUM(D22:D22)),Priser!$E$54:$J$56,2)+((SUM(D22:D22))-HLOOKUP((SUM(D22:D22)),Priser!$E$54:$J$56,1))*HLOOKUP((SUM(D22:D22)),Priser!$E$54:$J$56,3))/(SUM(D22:D22)))*(1+Genanskaffelsespriser!$D$196),\"Fejl\")","v":0},0,0]
["Pumpe inkl. stigrør og forerørsforsejlinger mv. 17","m³/h ",15,0,{"$f":"IF(COUNTIF(D23:D23,\"<>0\")<=1,IF((SUM(D23:D23))=0,0,(+HLOOKUP((SUM(D23:D23)),Priser!$E$54:$J$56,2)+((SUM(D23:D23))-HLOOKUP((SUM(D23:D23)),Priser!$E$54:$J$56,1))*HLOOKUP((SUM(D23:D23)),Priser!$E$54:$J$56,3))/(SUM(D23:D23)))*(1+Genanskaffelsespriser!$D$196),\"Fejl\")","v":0},0,0]
["Pumpe inkl. stigrør og forerørsforsejlinger mv. 18","m³/h ",15,0,{"$f":"IF(COUNTIF(D24:D24,\"<>0\")<=1,IF((SUM(D24:D24))=0,0,(+HLOOKUP((SUM(D24:D24)),Priser!$E$54:$J$56,2)+((SUM(D24:D24))-HLOOKUP((SUM(D24:D24)),Priser!$E$54:$J$56,1))*HLOOKUP((SUM(D24:D24)),Priser!$E$54:$J$56,3))/(SUM(D24:D24)))*(1+Genanskaffelsespriser!$D$196),\"Fejl\")","v":0},0,0]
["Pumpe inkl. stigrør og forerørsforsejlinger mv. 19","m³/h ",15,0,{"$f":"IF(COUNTIF(D25:D25,\"<>0\")<=1,IF((SUM(D25:D25))=0,0,(+HLOOKUP((SUM(D25:D25)),Priser!$E$54:$J$56,2)+((SUM(D25:D25))-HLOOKUP((SUM(D25:D25)),Priser!$E$54:$J$56,1))*HLOOKUP((SUM(D25:D25)),Priser!$E$54:$J$56,3))/(SUM(D25:D25)))*(1+Genanskaffelsespriser!$D$196),\"Fejl\")","v":0},0,0]
["Pumpe inkl. stigrør og forerørsforsejlinger mv. 20","m³/h ",15,0,{"$f":"IF(COUNTIF(D26:D26,\"<>0\")<=1,IF((SUM(D26:D26))=0,0,(+HLOOKUP((SUM(D26:D26)),Priser!$E$54:$J$56,2)+((SUM(D26:D26))-HLOOKUP((SUM(D26:D26)),Priser!$E$54:$J$56,1))*HLOOKUP((SUM(D26:D26)),Priser!$E$54:$J$56,3))/(SUM(D26:D26)))*(1+Genanskaffelsespriser!$D$196),\"Fejl\")","v":0},0,0]
["Pumpe inkl. stigrør og forerørsforsejlinger mv. 21","m³/h ",15,0,{"$f":"IF(COUNTIF(D27:D27,\"<>0\")<=1,IF((SUM(D27:D27))=0,0,(+HLOOKUP((SUM(D27:D27)),Priser!$E$54:$J$56,2)+((SUM(D27:D27))-HLOOKUP((SUM(D27:D27)),Priser!$E$54:$J$56,1))*HLOOKUP((SUM(D27:D27)),Priser!$E$54:$J$56,3))/(SUM(D27:D27)))*(1+Genanskaffelsespriser!$D$196),\"Fejl\")","v":0},0,0]
["Pumpe inkl. stigrør og forerørsforsejlinger mv. 22","m³/h ",15,0,{"$f":"IF(COUNTIF(D28:D28,\"<>0\")<=1,IF((SUM(D28:D28))=0,0,(+HLOOKUP((SUM(D28:D28)),Priser!$E$54:$J$56,2)+((SUM(D28:D28))-HLOOKUP((SUM(D28:D28)),Priser!$E$54:$J$56,1))*HLOOKUP((SUM(D28:D28)),Priser!$E$54:$J$56,3))/(SUM(D28:D28)))*(1+Genanskaffelsespriser!$D$196),\"Fejl\")","v":0},0,0]
["Pumpe inkl. stigrør og forerørsforsejlinger mv. 23","m³/h ",15,0,{"$f":"IF(COUNTIF(D29:D29,\"<>0\")<=1,IF((SUM(D29:D29))=0,0,(+HLOOKUP((SUM(D29:D29)),Priser!$E$54:$J$56,2)+((SUM(D29:D29))-HLOOKUP((SUM(D29:D29)),Priser!$E$54:$J$56,1))*HLOOKUP((SUM(D29:D29)),Priser!$E$54:$J$56,3))/(SUM(D29:D29)))*(1+Genanskaffelsespriser!$D$196),\"Fejl\")","v":0},0,0]
["Pumpe inkl. stigrør og forerørsforsejlinger mv. 24","m³/h ",15,0,{"$f":"IF(COUNTIF(D30:D30,\"<>0\")<=1,IF((SUM(D30:D30))=0,0,(+HLOOKUP((SUM(D30:D30)),Priser!$E$54:$J$56,2)+((SUM(D30:D30))-HLOOKUP((SUM(D30:D30)),Priser!$E$54:$J$56,1))*HLOOKUP((SUM(D30:D30)),Priser!$E$54:$J$56,3))/(SUM(D30:D30)))*(1+Genanskaffelsespriser!$D$196),\"Fejl\")","v":0},0,0]
["Pumpe inkl. stigrør og forerørsforsejlinger mv. 25","m³/h ",15,0,{"$f":"IF(COUNTIF(D31:D31,\"<>0\")<=1,IF((SUM(D31:D31))=0,0,(+HLOOKUP((SUM(D31:D31)),Priser!$E$54:$J$56,2)+((SUM(D31:D31))-HLOOKUP((SUM(D31:D31)),Priser!$E$54:$J$56,1))*HLOOKUP((SUM(D31:D31)),Priser!$E$54:$J$56,3))/(SUM(D31:D31)))*(1+Genanskaffelsespriser!$D$196),\"Fejl\")","v":0},0,0]
["Pumpe inkl. stigrør og forerørsforsejlinger mv. 26","m³/h ",15,0,{"$f":"IF(COUNTIF(D32:D32,\"<>0\")<=1,IF((SUM(D32:D32))=0,0,(+HLOOKUP((SUM(D32:D32)),Priser!$E$54:$J$56,2)+((SUM(D32:D32))-HLOOKUP((SUM(D32:D32)),Priser!$E$54:$J$56,1))*HLOOKUP((SUM(D32:D32)),Priser!$E$54:$J$56,3))/(SUM(D32:D32)))*(1+Genanskaffelsespriser!$D$196),\"Fejl\")","v":0},0,0]
["Pumpe inkl. stigrør og forerørsforsejlinger mv. 27","m³/h ",15,0,{"$f":"IF(COUNTIF(D33:D33,\"<>0\")<=1,IF((SUM(D33:D33))=0,0,(+HLOOKUP((SUM(D33:D33)),Priser!$E$54:$J$56,2)+((SUM(D33:D33))-HLOOKUP((SUM(D33:D33)),Priser!$E$54:$J$56,1))*HLOOKUP((SUM(D33:D33)),Priser!$E$54:$J$56,3))/(SUM(D33:D33)))*(1+Genanskaffelsespriser!$D$196),\"Fejl\")","v":0},0,0]
["Pumpe inkl. stigrør og forerørsforsejlinger mv. 28","m³/h ",15,0,{"$f":"IF(COUNTIF(D34:D34,\"<>0\")<=1,IF((SUM(D34:D34))=0,0,(+HLOOKUP((SUM(D34:D34)),Priser!$E$54:$J$56,2)+((SUM(D34:D34))-HLOOKUP((SUM(D34:D34)),Priser!$E$54:$J$56,1))*HLOOKUP((SUM(D34:D34)),Priser!$E$54:$J$56,3))/(SUM(D34:D34)))*(1+Genanskaffelsespriser!$D$196),\"Fejl\")","v":0},0,0]
["Pumpe inkl. stigrør og forerørsforsejlinger mv. 29","m³/h ",15,0,{"$f":"IF(COUNTIF(D35:D35,\"<>0\")<=1,IF((SUM(D35:D35))=0,0,(+HLOOKUP((SUM(D35:D35)),Priser!$E$54:$J$56,2)+((SUM(D35:D35))-HLOOKUP((SUM(D35:D35)),Priser!$E$54:$J$56,1))*HLOOKUP((SUM(D35:D35)),Priser!$E$54:$J$56,3))/(SUM(D35:D35)))*(1+Genanskaffelsespriser!$D$196),\"Fejl\")","v":0},0,0]
["Pumpe inkl. stigrør og forerørsforsejlinger mv. 30","m³/h ",15,0,{"$f":"IF(COUNTIF(D36:D36,\"<>0\")<=1,IF((SUM(D36:D36))=0,0,(+HLOOKUP((SUM(D36:D36)),Priser!$E$54:$J$56,2)+((SUM(D36:D36))-HLOOKUP((SUM(D36:D36)),Priser!$E$54:$J$56,1))*HLOOKUP((SUM(D36:D36)),Priser!$E$54:$J$56,3))/(SUM(D36:D36)))*(1+Genanskaffelsespriser!$D$196),\"Fejl\")","v":0},0,0]
["Pumpe inkl. stigrør og forerørsforsejlinger mv. 31","m³/h ",15,0,{"$f":"IF(COUNTIF(D37:D37,\"<>0\")<=1,IF((SUM(D37:D37))=0,0,(+HLOOKUP((SUM(D37:D37)),Priser!$E$54:$J$56,2)+((SUM(D37:D37))-HLOOKUP((SUM(D37:D37)),Priser!$E$54:$J$56,1))*HLOOKUP((SUM(D37:D37)),Priser!$E$54:$J$56,3))/(SUM(D37:D37)))*(1+Genanskaffelsespriser!$D$196),\"Fejl\")","v":0},0,0]
["Pumpe inkl. stigrør og forerørsforsejlinger mv. 32","m³/h ",15,0,{"$f":"IF(COUNTIF(D38:D38,\"<>0\")<=1,IF((SUM(D38:D38))=0,0,(+HLOOKUP((SUM(D38:D38)),Priser!$E$54:$J$56,2)+((SUM(D38:D38))-HLOOKUP((SUM(D38:D38)),Priser!$E$54:$J$56,1))*HLOOKUP((SUM(D38:D38)),Priser!$E$54:$J$56,3))/(SUM(D38:D38)))*(1+Genanskaffelsespriser!$D$196),\"Fejl\")","v":0},0,0]
["Pumpe inkl. stigrør og forerørsforsejlinger mv. 33","m³/h ",15,0,{"$f":"IF(COUNTIF(D39:D39,\"<>0\")<=1,IF((SUM(D39:D39))=0,0,(+HLOOKUP((SUM(D39:D39)),Priser!$E$54:$J$56,2)+((SUM(D39:D39))-HLOOKUP((SUM(D39:D39)),Priser!$E$54:$J$56,1))*HLOOKUP((SUM(D39:D39)),Priser!$E$54:$J$56,3))/(SUM(D39:D39)))*(1+Genanskaffelsespriser!$D$196),\"Fejl\")","v":0},0,0]
["Pumpe inkl. stigrør og forerørsforsejlinger mv. 34","m³/h ",15,0,{"$f":"IF(COUNTIF(D40:D40,\"<>0\")<=1,IF((SUM(D40:D40))=0,0,(+HLOOKUP((SUM(D40:D40)),Priser!$E$54:$J$56,2)+((SUM(D40:D40))-HLOOKUP((SUM(D40:D40)),Priser!$E$54:$J$56,1))*HLOOKUP((SUM(D40:D40)),Priser!$E$54:$J$56,3))/(SUM(D40:D40)))*(1+Genanskaffelsespriser!$D$196),\"Fejl\")","v":0},0,0]
{"$rows_left_out":158}
{"sheet":"Distributionsanlæg","index":1,"n_rows":162,"n_cols":7,"rows_kept":162,"cut":false,"hidden":false,"merged":[]}
["DISTRIBUTIONSANLÆG","Enhed","Standardlevetid","Mængde","Enhedspris","Samlet værdi","Afskrivning"]
["Ledningsnet - Land"]
["Ledningsnet ≤ Ø50 mm","meter",{"$f":"Genanskaffelsespriser!E81","v":75},0,{"$f":"Genanskaffelsespriser!$D81","v":529},{"$f":"D3*E3","v":0},{"$f":"F3/C3","v":0}]
["Ø 50mm < Ledningsnet ≤ Ø110 mm","meter",{"$f":"Genanskaffelsespriser!E82","v":75},0,{"$f":"Genanskaffelsespriser!$D82","v":808},{"$f":"D4*E4","v":0},{"$f":"F4/C4","v":0}]
["Ø110 mm < Ledningsnet ≤ Ø 250 mm","meter",{"$f":"Genanskaffelsespriser!E83","v":75},0,{"$f":"Genanskaffelsespriser!$D83","v":1513},0,0]
["Ø 250 mm < Ledningsnet ≤ Ø 500mm","meter",{"$f":"Genanskaffelsespriser!E84","v":75},0,{"$f":"Genanskaffelsespriser!$D84","v":2944},0,0]
["Ledningsnet > Ø 500 mm","meter",{"$f":"Genanskaffelsespriser!E85","v":75},0,{"$f":"Genanskaffelsespriser!$D85","v":5751},0,0]
["Støbejernsledninger ≤ Ø50 mm","meter",{"$f":"Genanskaffelsespriser!E86","v":100},0,{"$f":"Genanskaffelsespriser!$D86","v":899},0,0]
["Støbejernsledninger Ø 50mm < Ledningsnet ≤ Ø110 mm","meter",{"$f":"Genanskaffelsespriser!E87","v":100},0,{"$f":"Genanskaffelsespriser!$D87","v":1053},0,0]
["Støbejernsledninger Ø110 mm < Ledningsnet ≤ Ø 250 mm","meter",{"$f":"Genanskaffelsespriser!E88","v":100},0,{"$f":"Genanskaffelsespriser!$D88","v":1490},0,0]
["Støbejernsledninger Ø 250 mm < Ledningsnet ≤ Ø 500mm","meter",{"$f":"Genanskaffelsespriser!E89","v":100},0,{"$f":"Genanskaffelsespriser!$D89","v":2762},0,0]
["Støbejernsledninger Ledningsnet > Ø 500 mm","meter",{"$f":"Genanskaffelsespriser!E90","v":100},0,{"$f":"Genanskaffelsespriser!$D90","v":5484},0,0]
["Eternitledninger ≤ Ø50 mm","meter",{"$f":"Genanskaffelsespriser!E91","v":75},0,{"$f":"Genanskaffelsespriser!$D91","v":655},0,0]
["Eternitledninger Ø 50mm < Ledningsnet ≤ Ø110 mm","meter",{"$f":"Genanskaffelsespriser!E92","v":75},0,{"$f":"Genanskaffelsespriser!$D92","v":885},0,0]
["Eternitledninger Ø110 mm < Ledningsnet ≤ Ø 250 mm","meter",{"$f":"Genanskaffelsespriser!E93","v":75},0,{"$f":"Genanskaffelsespriser!$D93","v":1287},0,0]
["Eternitledninger Ø 250 mm < Ledningsnet ≤ Ø 500mm","meter",{"$f":"Genanskaffelsespriser!E94","v":75},0,{"$f":"Genanskaffelsespriser!$D94","v":3056},0,0]
["Eternitledninger Ledningsnet > Ø 500 mm","meter",{"$f":"Genanskaffelsespriser!E95","v":75},0,{"$f":"Genanskaffelsespriser!$D95","v":8477},0,0]
["Skelbrønd, Konstruktioner","stk.",{"$f":"Genanskaffelsespriser!E96","v":50},0,{"$f":"Genanskaffelsespriser!$D96","v":10415},0,0]
["Skelbrønd, Mek./EL","stk.",{"$f":"Genanskaffelsespriser!E97","v":15},0,{"$f":"Genanskaffelsespriser!$D97","v":15623},0,0]
["Inspektionsbrønd, Konstruktioner","stk.",{"$f":"Genanskaffelsespriser!E98","v":50},0,{"$f":"Genanskaffelsespriser!$D98","v":10415},0,0]
["Inspektionsbrønd, Mek./EL","stk.",{"$f":"Genanskaffelsespriser!E99","v":15},0,{"$f":"Genanskaffelsespriser!$D99","v":13019},0,0]
["Stik på ledningsnet, Konstruktioner","stk.",{"$f":"Genanskaffelsespriser!E100","v":75},0,{"$f":"Genanskaffelsespriser!$D100","v":4722},0,0]
["Stik på ledningsnet, Mek./EL","stk.",{"$f":"Genanskaffelsespriser!E101","v":75},0,{"$f":"Genanskaffelsespriser!$D101","v":4722},0,0]
["Ledningsnet - By"]
["Ledningsnet ≤ Ø50 mm","meter",{"$f":"Genanskaffelsespriser!E103","v":75},0,{"$f":"Genanskaffelsespriser!$D103","v":650},0,0]
["Ø 50mm < Ledningsnet ≤ Ø110 mm","meter",{"$f":"Genanskaffelsespriser!E104","v":75},0,{"$f":"Genanskaffelsespriser!$D104","v":958},0,0]
["Ø110 mm < Ledningsnet ≤ Ø 250 mm","meter",{"$f":"Genanskaffelsespriser!E105","v":75},0,{"$f":"Genanskaffelsespriser!$D105","v":1684},0,0]
["Ø 250 mm < Ledningsnet ≤ Ø 500mm","meter",{"$f":"Genanskaffelsespriser!E106","v":75},0,{"$f":"Genanskaffelsespriser!$D106","v":3153},0,0]
["Ledningsnet > Ø 500 mm","meter",{"$f":"Genanskaffelsespriser!E107","v":75},0,{"$f":"Genanskaffelsespriser!$D107","v":5998},0,0]
["Støbejernsledninger ≤ Ø50 mm","meter",{"$f":"Genanskaffelsespriser!E108","v":100},0,{"$f":"Genanskaffelsespriser!$D108","v":1020},0,0]
["Støbejernsledninger Ø 50mm < Ledningsnet ≤ Ø110 mm","meter",{"$f":"Genanskaffelsespriser!E109","v":100},0,{"$f":"Genanskaffelsespriser!$D109","v":1203},0,0]
["Støbejernsledninger Ø110 mm < Ledningsnet ≤ Ø 250 mm","meter",{"$f":"Genanskaffelsespriser!E110","v":100},0,{"$f":"Genanskaffelsespriser!$D110","v":1661},0,0]
["Støbejernsledninger Ø 250 mm < Ledningsnet ≤ Ø 500mm","meter",{"$f":"Genanskaffelsespriser!E111","v":100},0,{"$f":"Genanskaffelsespriser!$D111","v":2971},0,0]
["Støbejernsledninger Ledningsnet > Ø 500 mm","meter",{"$f":"Genanskaffelsespriser!E112","v":100},0,{"$f":"Genanskaffelsespriser!$D112","v":5731},0,0]
["Eternitledninger ≤ Ø50 mm","meter",{"$f":"Genanskaffelsespriser!E113","v":75},0,{"$f":"Genanskaffelsespriser!$D113","v":776},0,0]
["Eternitledninger Ø 50mm < Ledningsnet ≤ Ø110 mm","meter",{"$f":"Genanskaffelsespriser!E114","v":75},0,{"$f":"Genanskaffelsespriser!$D114","v":1035},0,0]
["Eternitledninger Ø110 mm < Ledningsnet ≤ Ø 250 mm","meter",{"$f":"Genanskaffelsespriser!E115","v":75},0,{"$f":"Genanskaffelsespriser!$D115","v":1456},0,0]
["Eternitledninger Ø 250 mm < Ledningsnet ≤ Ø 500mm","meter",{"$f":"Genanskaffelsespriser!E116","v":75},0,{"$f":"Genanskaffelsespriser!$D116","v":3265},0,0]
["Eternitledninger Ledningsnet > Ø 500 mm","meter",{"$f":"Genanskaffelsespriser!E117","v":75},0,{"$f":"Genanskaffelsespriser!$D117","v":8724},0,0]
["Skelbrønd, Konstruktioner","stk.",{"$f":"Genanskaffelsespriser!E118","v":50},0,{"$f":"Genanskaffelsespriser!$D118","v":11457},0,0]
{"$rows_left_out":123}
{"sheet":"Fællesfunktionsanlæg","index":2,"n_rows":6,"n_cols":7,"rows_kept":6,"cut":false,"hidden":false,"merged":[]}
["FÆLLESFUNKTIONSANLÆG","Enhed","Standardlevetid","Mængde","Enhedspris","Samlet værdi","Afskrivning"]
["Andre"]
["Køretøjer, personbil","stk.",{"$f":"Genanskaffelsespriser!E191","v":5},0,{"$f":"Genanskaffelsespriser!$D191","v":225000},{"$f":"E3*D3","v":0},{"$f":"F3/C3","v":0}]
["Køretøjer, små lastvogne (< 3.500 kg.)","stk.",{"$f":"Genanskaffelsespriser!E192","v":5},0,{"$f":"Genanskaffelsespriser!$D192","v":250000},{"$f":"E4*D4","v":0},{"$f":"F4/C4","v":0}]
["Køretøjer, store lastvogne (> 3.500 kg.)","stk.",{"$f":"Genanskaffelsespriser!E193","v":5},0,{"$f":"Genanskaffelsespriser!$D193","v":1300000},0,0]
["Køretøjer, entreprenørmaskiner","stk.",{"$f":"Genanskaffelsespriser!E194","v":5},0,{"$f":"Genanskaffelsespriser!$D194","v":400000},0,0]

{"sheet":"Genanskaffelsespriser","index":3,"n_rows":196,"n_cols":5,"rows_kept":196,"cut":false,"hidden":true,"merged":[[0,4,1,4],[0,3,1,3],[0,1,1,1],[0,2,1,2]]}
[null,"Genanskaffelsespriser","Måleenhed","Vægtet \nenhedspris","Teknisk levetid"]
[]
[null,"Produktionsanlæg:"]
[null,"Boringer:"]
[null,"Boring (inkl. etablering, forerør, filter og prøvepumpning)","kr./m.",{"$f":"2538","v":2538},30]
[null,"Råvandsstationer:"]
[null,"Råvandsstation komplet montering og boringshus/tørbrønd","kr./stk.",{"$f":"57810*(1+D196)","v":57810},30]
[null,"Instrumenter (flowmåler+tryk transducer+alarmer)","kr./stk.",{"$f":"65241*(1+D196)","v":65241},10]
[null,"Pumpe inkl. stigrør og forerørsforsejlinger mv.","kr/m³/h ","Variabel",15]
[null,"Erstatninger (OBS ingen øst-tillæg eller øvrige tillæg) ","kr/stk",{"$f":"44911","v":44911},30]
[null,"Hegn","kr./stk.",{"$f":"85428*(1+D196)","v":85428},15]
[null,"Elanlæg","kr./boring",{"$f":"108657*(1+D196)","v":108657},20]
[null,"SRO anlæg","kr./boring",{"$f":"29256*(1+D196)","v":29256},10]
[null,"Råvandsledninger - Land"]
[null,"Ø 50mm < Ledningsnet ≤ Ø110 mm","kr./m.",{"$f":"354*(1+D196)","v":354},75]
[null,"Ø110 mm < Ledningsnet ≤ Ø 250 mm","kr./m.",{"$f":"1018*(1+D196)","v":1018},75]
[null,"Ø 250 mm < Ledningsnet ≤ Ø 500mm","kr./m.",{"$f":"2335*(1+D196)","v":2335},75]
[null,"Ledningsnet > Ø 500 mm","kr./m.",{"$f":"5029*(1+D196)","v":5029},75]
[null,"Råvandsledninger - By"]
[null,"Ø 50mm < Ledningsnet ≤ Ø110 mm","kr./m.",{"$f":"958*(1+D196)","v":958},75]
[null,"Ø110 mm < Ledningsnet ≤ Ø 250 mm","kr./m.",{"$f":"1684*(1+D196)","v":1684},75]
[null,"Ø 250 mm < Ledningsnet ≤ Ø 500mm","kr./m.",{"$f":"3153*(1+D196)","v":3153},75]
[null,"Ledningsnet > Ø 500 mm","kr./m.",{"$f":"5998*(1+D196)","v":5998},75]
[null,"Råvandsledninger - City"]
[null,"Ø 50mm < Ledningsnet ≤ Ø110 mm","kr./m.",{"$f":"1495*(1+D196)","v":1495},75]
[null,"Ø110 mm < Ledningsnet ≤ Ø 250 mm","kr./m.",{"$f":"2192*(1+D196)","v":2192},75]
[null,"Ø 250 mm < Ledningsnet ≤ Ø 500mm","kr./m.",{"$f":"3773*(1+D196)","v":3773},75]
[null,"Ledningsnet > Ø 500 mm","kr./m.",{"$f":"6732*(1+D196)","v":6732},75]
[null,"Vandværker: Behandling og Udpumpning"]
[null,"Beluftningsanlæg, iltningstrappe, Kontruktioner","kr/m³/h ","Variabel",50]
[null,"Beluftningsanlæg, iltningstrappe, Mek./EL","kr/m³/h ","Variabel",25]
[null,"Beluftningsanlæg, ika-beluftning, Kontruktioner","kr/m³/h ","Variabel",50]
[null,"Beluftningsanlæg, ika-beluftning, Mek./EL","kr/m³/h ","Variabel",25]
[null,"Beluftningsanlæg, bundbeluftbning, Kontruktioner","kr/m³/h ","Variabel",50]
[null,"Beluftningsanlæg, bundbeluftbning, Mek./EL","kr/m³/h ","Variabel",25]
[null,"Beluftningsanlæg, rislebakke, Kontruktioner","kr/m³/h ","Variabel",50]
[null,"Beluftningsanlæg, rislebakke, Mek./EL","kr/m³/h ","Variabel",25]
[null,"Beluftningsanlæg, kompressorbeluftning","kr/m³/h ","Variabel",25]
[null,"Beluftningsanlæg, ren ilt","kr/m³/h ","Variabel",25]
[null,"Behandlingsanlæg, kalk anlæg","kr/m³/h ","Variabel",25]
{"$rows_left_out":157}
{"sheet":"Priser","index":4,"n_rows":380,"n_cols":23,"rows_kept":380,"cut":false,"hidden":true,"merged":[]}
["Til bestemmelse af diverse tillæg",null,null,null,null,null,"Til bestemmelse af øst-tillæg",null,null,null,"Til bestemmelse af tilæg for beliggenhed af vandværksanlæg"]
["Uforudseelig,",null,0.2,"Kan ændres",null,null,"Øst = Sjælland",1.1000000000000001,"Kan ændres",null,"Land",0.95,"Kan ændres"]
["Projektering,",null,0.15,"Kan ændres",null,null,"Vest = Rest af landet",1,"Kan ændres",null,"By",1]
["Administration,",null,0.06,"Kan ændres",null,null,null,null,null,null,"City",1.05,"Kan ændres"]
["Index factor (1.0 per 01.04.2009)",null,1,"Kan ændres",null,null,2,null,null,null,"Indre City",1.1000000000000001,"Kan ændres"]
["Totalt tillæg ufor + proj + Adm",null,0.46279999999999988,null,null,null,1]
["Øst / vest faktor",null,1]
["Faktor",null,1.4627999999999999]
[]
["Boringer"]
[]
["Der er benyttet priser på luftskylleboring (lufthæveboring)"]
["I Thomson er prisen opdelt i en pris for  de første 10 meter + en anden pris for de efterfølgende meter"]
[null,null,"kr/m","kr/m"]
[null,null,"0 - 10 m","efterfølgende"]
["05-33.01",null,4400,null,null,"ø400 mm Boring"]
["05-33-02",null,null,500,null,"ø400 mm Boring"]
["05-51,01",null,1230,null,null,"Renpumpning fordelt på de første 10 meter"]
["05-41.03",null,900,null,null,"Forudsættes et 10 meter ø 200 mm filter"]
["05-42.03",null,null,550,null,"ø200 mm forerør"]
["Sum ekskl. tillæg",null,6530,1050]
["Sum inkl tillæg",null,9552.0839999999989,1535.94]
[]
["Dybde",null,"Totalpris",null,"Enhedspris"]
[50,"meter",156958.44,"kr",3139.1687999999999,"kr/m"]
[]
[]
["Råvandsstation"]
[]
[]
["05-71.02 ekskl. tillæg",null,25700,"kr/stk"]
["05-71.01 inkl. tillæg",null,57809.855999999992,"kr/stk"]
[]
[]
[]
[]
[]
[]
[]
[]
{"$rows_left_out":340}