{"text_format":"1","workbook":"xlsx","n_sheets":5,"sheets":["Produktionsanlæg","Distributionsanlæg","Fællesfunktionsanlæg","Genanskaffelsespriser","Variable priser"],"not_rendered":{"charts":0,"images":3,"macros":1,"external_links":0,"defined_names":8,"comments":1,"pivot_tables":0},"unopened":[],"bounds":{"document_bytes":16777216,"sheet_cells":100000,"rows_first":2000,"rows_last":500,"rows_between":2000,"halvings":0,"cell_chars":16384,"cell_head_chars":4096},"cells_cut":0,"cells_raw":0,"read":"row_number_cap","date_system":"1900"}

{"sheet":"Produktionsanlæg","index":0,"n_rows":244,"n_cols":21,"rows_kept":244,"cut":false,"hidden":false,"merged":[]}
["Produktionsanlæg","Enhed","Standard-levetid","Samlet mængde per 31/12-2023","Samlet mængde per 31/12-2024","Samlet mængde per 31/12-2025","Afvigelse\n2023-2024","Afvigelse\n2024-2025","Bemærkninger","Enhedspris\n2024","Enhedspris\n2025","Netvolumenbidrag\n2024","Netvolumenbidrag\n2025","Ejerandel\n2024 (%)","Ejerandel\n2025 (%)",null,"Postnr.","Selskabsnavn","CAPEX Netvolumenmål\n2024","CAPEX Netvolumenmål\n2025","Gennemsnitligt\nCAPEX Netvolumenmål"]
["Boringer",null,null,null,null,null,null,null,null,null,null,null,null,null,null,null,3460,"Novafos Vand Ballerup",{"$f":"SUMIFS(L:L,L:L,\">0\") + SUMIFS(Distributionsanlæg!L:L,Distributionsanlæg!L:L,\">0\") + SUMIFS(Fællesfunktionsanlæg!L:L,Fællesfunktionsanlæg!L:L,\">0\")","v":13828350.562448436},{"$f":"SUMIFS(M:M,M:M,\">0\") + SUMIFS(Distributionsanlæg!M:M,Distributionsanlæg!M:M,\">0\") + SUMIFS(Fællesfunktionsanlæg!M:M,Fællesfunktionsanlæg!M:M,\">0\")","v":13967775.369013345},{"$f":"AVERAGE(S2:T2)","v":13898062.965730891}]
["Boring (inkl. etablering, forerør, filter og prøvepumpning)","dybdemeter",{"$f":"Genanskaffelsespriser!E5","v":30},649,649,649,{"$f":"IF($D3=\"\",IF($E3>0,\"Ny data\",IF($E3=\"\",\"\",0)),IF($D3=0,IF($E3=0,0,\"Ny data\"),($E3-$D3)/$D3))","v":0},{"$f":"IF($E3=\"\",IF($F3>0,\"Ny data\",IF($F3=\"\",\"\",0)),IF($E3=0,IF($F3=0,0,\"Ny data\"),($F3-$E3)/$E3))","v":0},null,{"$f":"Genanskaffelsespriser!$D5","v":2538},{"$f":"J3","v":2538},{"$f":"IF(ISNUMBER(E3),((J3*E3)/C3)*N3,\"\")","v":54905.4},{"$f":"IF(ISNUMBER(F3),((K3*F3)/C3)*O3,\"\")","v":54905.4},1,1]
["Råvandsstationer"]
["Råvandsstation komplet montering og boringshus/tørbrønd","stk.",{"$f":"Genanskaffelsespriser!E7","v":30},11,11,11,{"$f":"IF($D5=\"\",IF($E5>0,\"Ny data\",IF($E5=\"\",\"\",0)),IF($D5=0,IF($E5=0,0,\"Ny data\"),($E5-$D5)/$D5))","v":0},{"$f":"IF($E5=\"\",IF($F5>0,\"Ny data\",IF($F5=\"\",\"\",0)),IF($E5=0,IF($F5=0,0,\"Ny data\"),($F5-$E5)/$E5))","v":0},null,{"$f":"Genanskaffelsespriser!$D7","v":59948.969999999994},{"$f":"J5","v":59948.969999999994},{"$f":"IF(ISNUMBER(E5),((J5*E5)/C5)*N5,\"\")","v":21981.288999999997},{"$f":"IF(ISNUMBER(F5),((K5*F5)/C5)*O5,\"\")","v":21981.288999999997},1,1]
["Instrumenter (flowmåler+tryk transducer+alarmer)","stk.",{"$f":"Genanskaffelsespriser!E8","v":10},11,11,11,0,0,null,{"$f":"Genanskaffelsespriser!$D8","v":67654.917000000001},{"$f":"J6","v":67654.917000000001},74420.4087,74420.4087,1,1]
["Pumpe inkl. stigrør og forerørsforsejlinger mv. 1","m³/h ",{"$f":"Genanskaffelsespriser!E9","v":15},27,27,27,0,0,null,{"$f":"IF(E7=0,\"Variabel pris\",IFERROR(((HLOOKUP(E7,'Variable priser'!$C$2:$H$4,2)+(E7-HLOOKUP(E7,'Variable priser'!$C$2:$H$4,1))*HLOOKUP(E7,'Variable priser'!$C$2:$H$4,3))/E7*(1+Genanskaffelsespriser!$D$203)),\"Fejl\"))","v":2799.5667773333325},{"$f":"IF(F7=0,\"Variabel pris\",IFERROR(((HLOOKUP(F7,'Variable priser'!$C$2:$H$4,2)+(F7-HLOOKUP(F7,'Variable priser'!$C$2:$H$4,1))*HLOOKUP(F7,'Variable priser'!$C$2:$H$4,3))/F7*(1+Genanskaffelsespriser!$D$203)),\"Fejl\"))","v":2799.5667773333325},{"$f":"IF(ISBLANK(E7),\"\",IF(E7=0,\"\",IF(ISNUMBER(E7),((J7*E7)/C7)*N7,\"\")))","v":5039.2201991999991},{"$f":"IF(ISBLANK(F7),\"\",IF(F7=0,\"\",IF(ISNUMBER(F7),((K7*F7)/C7)*N7,\"\")))","v":5039.2201991999991},1,1]
["Pumpe inkl. stigrør og forerørsforsejlinger mv. 2","m³/h ",{"$f":"Genanskaffelsespriser!E9","v":15},27,27,27,0,0,null,{"$f":"IF(E8=0,\"Variabel pris\",IFERROR(((HLOOKUP(E8,'Variable priser'!$C$2:$H$4,2)+(E8-HLOOKUP(E8,'Variable priser'!$C$2:$H$4,1))*HLOOKUP(E8,'Variable priser'!$C$2:$H$4,3))/E8*(1+Genanskaffelsespriser!$D$203)),\"Fejl\"))","v":2799.5667773333325},{"$f":"IF(F8=0,\"Variabel pris\",IFERROR(((HLOOKUP(F8,'Variable priser'!$C$2:$H$4,2)+(F8-HLOOKUP(F8,'Variable priser'!$C$2:$H$4,1))*HLOOKUP(F8,'Variable priser'!$C$2:$H$4,3))/F8*(1+Genanskaffelsespriser!$D$203)),\"Fejl\"))","v":2799.5667773333325},{"$f":"IF(ISBLANK(E8),\"\",IF(E8=0,\"\",IF(ISNUMBER(E8),((J8*E8)/C8)*N8,\"\")))","v":5039.2201991999991},{"$f":"IF(ISBLANK(F8),\"\",IF(F8=0,\"\",IF(ISNUMBER(F8),((K8*F8)/C8)*N8,\"\")))","v":5039.2201991999991},1,1]
["Pumpe inkl. stigrør og forerørsforsejlinger mv. 3","m³/h ",{"$f":"Genanskaffelsespriser!E9","v":15},28,28,28,0,0,null,{"$f":"IF(E9=0,\"Variabel pris\",IFERROR(((HLOOKUP(E9,'Variable priser'!$C$2:$H$4,2)+(E9-HLOOKUP(E9,'Variable priser'!$C$2:$H$4,1))*HLOOKUP(E9,'Variable priser'!$C$2:$H$4,3))/E9*(1+Genanskaffelsespriser!$D$203)),\"Fejl\"))","v":2752.1328171428572},{"$f":"IF(F9=0,\"Variabel pris\",IFERROR(((HLOOKUP(F9,'Variable priser'!$C$2:$H$4,2)+(F9-HLOOKUP(F9,'Variable priser'!$C$2:$H$4,1))*HLOOKUP(F9,'Variable priser'!$C$2:$H$4,3))/F9*(1+Genanskaffelsespriser!$D$203)),\"Fejl\"))","v":2752.1328171428572},5137.3145919999997,5137.3145919999997,1,1]
["Pumpe inkl. stigrør og forerørsforsejlinger mv. 4","m³/h ",{"$f":"Genanskaffelsespriser!E9","v":15},11,11,11,0,0,null,{"$f":"IF(E10=0,\"Variabel pris\",IFERROR(((HLOOKUP(E10,'Variable priser'!$C$2:$H$4,2)+(E10-HLOOKUP(E10,'Variable priser'!$C$2:$H$4,1))*HLOOKUP(E10,'Variable priser'!$C$2:$H$4,3))/E10*(1+Genanskaffelsespriser!$D$203)),\"Fejl\"))","v":4339.2289088727257},{"$f":"IF(F10=0,\"Variabel pris\",IFERROR(((HLOOKUP(F10,'Variable priser'!$C$2:$H$4,2)+(F10-HLOOKUP(F10,'Variable priser'!$C$2:$H$4,1))*HLOOKUP(F10,'Variable priser'!$C$2:$H$4,3))/F10*(1+Genanskaffelsespriser!$D$203)),\"Fejl\"))","v":4339.2289088727257},3182.101199839999,3182.101199839999,1,1]
["Pumpe inkl. stigrør og forerørsforsejlinger mv. 5","m³/h ",{"$f":"Genanskaffelsespriser!E9","v":15},30,30,30,0,0,null,{"$f":"IF(E11=0,\"Variabel pris\",IFERROR(((HLOOKUP(E11,'Variable priser'!$C$2:$H$4,2)+(E11-HLOOKUP(E11,'Variable priser'!$C$2:$H$4,1))*HLOOKUP(E11,'Variable priser'!$C$2:$H$4,3))/E11*(1+Genanskaffelsespriser!$D$203)),\"Fejl\"))","v":2666.7516888},{"$f":"IF(F11=0,\"Variabel pris\",IFERROR(((HLOOKUP(F11,'Variable priser'!$C$2:$H$4,2)+(F11-HLOOKUP(F11,'Variable priser'!$C$2:$H$4,1))*HLOOKUP(F11,'Variable priser'!$C$2:$H$4,3))/F11*(1+Genanskaffelsespriser!$D$203)),\"Fejl\"))","v":2666.7516888},5333.5033776,5333.5033776,1,1]
["Pumpe inkl. stigrør og forerørsforsejlinger mv. 6","m³/h ",{"$f":"Genanskaffelsespriser!E9","v":15},28,28,28,0,0,null,{"$f":"IF(E12=0,\"Variabel pris\",IFERROR(((HLOOKUP(E12,'Variable priser'!$C$2:$H$4,2)+(E12-HLOOKUP(E12,'Variable priser'!$C$2:$H$4,1))*HLOOKUP(E12,'Variable priser'!$C$2:$H$4,3))/E12*(1+Genanskaffelsespriser!$D$203)),\"Fejl\"))","v":2752.1328171428572},{"$f":"IF(F12=0,\"Variabel pris\",IFERROR(((HLOOKUP(F12,'Variable priser'!$C$2:$H$4,2)+(F12-HLOOKUP(F12,'Variable priser'!$C$2:$H$4,1))*HLOOKUP(F12,'Variable priser'!$C$2:$H$4,3))/F12*(1+Genanskaffelsespriser!$D$203)),\"Fejl\"))","v":2752.1328171428572},5137.3145919999997,5137.3145919999997,1,1]
["Pumpe inkl. stigrør og forerørsforsejlinger mv. 7","m³/h ",{"$f":"Genanskaffelsespriser!E9","v":15},21,21,21,0,0,null,{"$f":"IF(E13=0,\"Variabel pris\",IFERROR(((HLOOKUP(E13,'Variable priser'!$C$2:$H$4,2)+(E13-HLOOKUP(E13,'Variable priser'!$C$2:$H$4,1))*HLOOKUP(E13,'Variable priser'!$C$2:$H$4,3))/E13*(1+Genanskaffelsespriser!$D$203)),\"Fejl\"))","v":3179.0384588571424},{"$f":"IF(F13=0,\"Variabel pris\",IFERROR(((HLOOKUP(F13,'Variable priser'!$C$2:$H$4,2)+(F13-HLOOKUP(F13,'Variable priser'!$C$2:$H$4,1))*HLOOKUP(F13,'Variable priser'!$C$2:$H$4,3))/F13*(1+Genanskaffelsespriser!$D$203)),\"Fejl\"))","v":3179.0384588571424},4450.6538423999991,4450.6538423999991,1,1]
["Pumpe inkl. stigrør og forerørsforsejlinger mv. 8","m³/h ",{"$f":"Genanskaffelsespriser!E9","v":15},23,23,23,0,0,null,{"$f":"IF(E14=0,\"Variabel pris\",IFERROR(((HLOOKUP(E14,'Variable priser'!$C$2:$H$4,2)+(E14-HLOOKUP(E14,'Variable priser'!$C$2:$H$4,1))*HLOOKUP(E14,'Variable priser'!$C$2:$H$4,3))/E14*(1+Genanskaffelsespriser!$D$203)),\"Fejl\"))","v":3030.54954},{"$f":"IF(F14=0,\"Variabel pris\",IFERROR(((HLOOKUP(F14,'Variable priser'!$C$2:$H$4,2)+(F14-HLOOKUP(F14,'Variable priser'!$C$2:$H$4,1))*HLOOKUP(F14,'Variable priser'!$C$2:$H$4,3))/F14*(1+Genanskaffelsespriser!$D$203)),\"Fejl\"))","v":3030.54954},4646.8426279999994,4646.8426279999994,1,1]
["Pumpe inkl. stigrør og forerørsforsejlinger mv. 9","m³/h ",{"$f":"Genanskaffelsespriser!E9","v":15},21,21,21,0,0,null,{"$f":"IF(E15=0,\"Variabel pris\",IFERROR(((HLOOKUP(E15,'Variable priser'!$C$2:$H$4,2)+(E15-HLOOKUP(E15,'Variable priser'!$C$2:$H$4,1))*HLOOKUP(E15,'Variable priser'!$C$2:$H$4,3))/E15*(1+Genanskaffelsespriser!$D$203)),\"Fejl\"))","v":3179.0384588571424},{"$f":"IF(F15=0,\"Variabel pris\",IFERROR(((HLOOKUP(F15,'Variable priser'!$C$2:$H$4,2)+(F15-HLOOKUP(F15,'Variable priser'!$C$2:$H$4,1))*HLOOKUP(F15,'Variable priser'!$C$2:$H$4,3))/F15*(1+Genanskaffelsespriser!$D$203)),\"Fejl\"))","v":3179.0384588571424},4450.6538423999991,4450.6538423999991,1,1]
["Pumpe inkl. stigrør og forerørsforsejlinger mv. 10","m³/h ",15,18,18,18,0,0,null,{"$f":"IF(E16=0,\"Variabel pris\",IFERROR(((HLOOKUP(E16,'Variable priser'!$C$2:$H$4,2)+(E16-HLOOKUP(E16,'Variable priser'!$C$2:$H$4,1))*HLOOKUP(E16,'Variable priser'!$C$2:$H$4,3))/E16*(1+Genanskaffelsespriser!$D$203)),\"Fejl\"))","v":3410.3813469333331},{"$f":"IF(F16=0,\"Variabel pris\",IFERROR(((HLOOKUP(F16,'Variable priser'!$C$2:$H$4,2)+(F16-HLOOKUP(F16,'Variable priser'!$C$2:$H$4,1))*HLOOKUP(F16,'Variable priser'!$C$2:$H$4,3))/F16*(1+Genanskaffelsespriser!$D$203)),\"Fejl\"))","v":3410.3813469333331},4092.4576163199995,4092.4576163199995,1,1]
["Pumpe inkl. stigrør og forerørsforsejlinger mv. 11","m³/h ",15,20,20,20,0,0,null,{"$f":"IF(E17=0,\"Variabel pris\",IFERROR(((HLOOKUP(E17,'Variable priser'!$C$2:$H$4,2)+(E17-HLOOKUP(E17,'Variable priser'!$C$2:$H$4,1))*HLOOKUP(E17,'Variable priser'!$C$2:$H$4,3))/E17*(1+Genanskaffelsespriser!$D$203)),\"Fejl\"))","v":3264.4195871999996},{"$f":"IF(F17=0,\"Variabel pris\",IFERROR(((HLOOKUP(F17,'Variable priser'!$C$2:$H$4,2)+(F17-HLOOKUP(F17,'Variable priser'!$C$2:$H$4,1))*HLOOKUP(F17,'Variable priser'!$C$2:$H$4,3))/F17*(1+Genanskaffelsespriser!$D$203)),\"Fejl\"))","v":3264.4195871999996},{"$f":"IF(ISBLANK(E17),\"\",IF(E17=0,\"\",IF(ISNUMBER(E17),((J17*E17)/C17)*N17,\"\")))","v":4352.5594495999994},{"$f":"IF(ISBLANK(F17),\"\",IF(F17=0,\"\",IF(ISNUMBER(F17),((K17*F17)/C17)*N17,\"\")))","v":4352.5594495999994},1,1]
["Pumpe inkl. stigrør og forerørsforsejlinger mv. 12","m³/h ",15,20,20,20,0,0,null,{"$f":"IF(E18=0,\"Variabel pris\",IFERROR(((HLOOKUP(E18,'Variable priser'!$C$2:$H$4,2)+(E18-HLOOKUP(E18,'Variable priser'!$C$2:$H$4,1))*HLOOKUP(E18,'Variable priser'!$C$2:$H$4,3))/E18*(1+Genanskaffelsespriser!$D$203)),\"Fejl\"))","v":3264.4195871999996},{"$f":"IF(F18=0,\"Variabel pris\",IFERROR(((HLOOKUP(F18,'Variable priser'!$C$2:$H$4,2)+(F18-HLOOKUP(F18,'Variable priser'!$C$2:$H$4,1))*HLOOKUP(F18,'Variable priser'!$C$2:$H$4,3))/F18*(1+Genanskaffelsespriser!$D$203)),\"Fejl\"))","v":3264.4195871999996},4352.5594495999994,4352.5594495999994,1,1]
["Hegn","stk.",{"$f":"Genanskaffelsespriser!E11","v":15},5,5,5,0,0,null,{"$f":"Genanskaffelsespriser!$D11","v":88588.835999999996},{"$f":"J19","v":88588.835999999996},29529.612000000001,29529.612000000001,1,1]
["Elanlæg","boring",{"$f":"Genanskaffelsespriser!E12","v":20},12,12,12,0,0,null,{"$f":"Genanskaffelsespriser!$D12","v":112677.30899999999},{"$f":"J20","v":112677.30899999999},67606.385399999999,67606.385399999999,1,1]
["SRO anlæg","boring",{"$f":"Genanskaffelsespriser!E13","v":10},12,12,12,0,0,null,{"$f":"Genanskaffelsespriser!$D13","v":30338.471999999998},30338.471999999998,36406.166400000002,36406.166400000002,1,1]
["Råvandsledninger - Land"]
["Ø 50mm < Ledningsnet ≤ Ø110 mm","meter",{"$f":"Genanskaffelsespriser!E15","v":75},170.72497104331012,170.72497104331012,170.44345927109697,0,-1.6489197244715624E-3,null,{"$f":"Genanskaffelsespriser!$D15","v":367.09799999999996},{"$f":"J23","v":367.09799999999996},835.63727226742742,834.25937348668197,1,1]
["Ø110 mm < Ledningsnet ≤ Ø 250 mm","meter",{"$f":"Genanskaffelsespriser!E16","v":75},0,0,1624.852642704971,0,"Ny data","Nye råvandsledninger",{"$f":"Genanskaffelsespriser!$D16","v":1055.6659999999999},{"$f":"J24","v":1055.6659999999999},0,22870.689198850476,1,1]
["Ø 250 mm < Ledningsnet ≤ Ø 500mm","meter",{"$f":"Genanskaffelsespriser!E17","v":75},0,0,0,0,0,null,{"$f":"Genanskaffelsespriser!$D17","v":2421.395},2421.395,0,0,1,1]
["Ledningsnet > Ø 500 mm","meter",{"$f":"Genanskaffelsespriser!E18","v":75},0,0,0,0,0,null,{"$f":"Genanskaffelsespriser!$D18","v":5215.0729999999994},5215.0729999999994,0,0,1,1]
["Råvandsledninger - By"]
["Ø 50mm < Ledningsnet ≤ Ø110 mm","meter",{"$f":"Genanskaffelsespriser!E20","v":75},1547,1547,1549.3353047956921,0,1.5095700036794324E-3,null,{"$f":"Genanskaffelsespriser!$D20","v":993.44599999999991},{"$f":"J28","v":993.44599999999991},20491.479493333332,20522.41281610748,1,1]
["Ø110 mm < Ledningsnet ≤ Ø 250 mm","meter",{"$f":"Genanskaffelsespriser!E21","v":75},638,638,5673.3724059859387,0,7.8924332382224742,"Nye råvandsledninger",{"$f":"Genanskaffelsespriser!$D21","v":1746.3079999999998},{"$f":"J29","v":1746.3079999999998},14855.260053333333,132099.40826069989,1,1]
["Ø 250 mm < Ledningsnet ≤ Ø 500mm","meter",{"$f":"Genanskaffelsespriser!E22","v":75},0,0,0,0,0,null,{"$f":"Genanskaffelsespriser!$D22","v":3269.6609999999996},3269.6609999999996,0,0,1,1]
["Ledningsnet > Ø 500 mm","meter",{"$f":"Genanskaffelsespriser!E23","v":75},0,0,0,0,0,null,{"$f":"Genanskaffelsespriser!$D23","v":6219.9259999999995},6219.9259999999995,0,0,1,1]
["Råvandsledninger - City"]
["Ø 50mm < Ledningsnet ≤ Ø110 mm","meter",{"$f":"Genanskaffelsespriser!E25","v":75},83,83,84.179642571052,0,1.4212561097012045E-2,null,{"$f":"Genanskaffelsespriser!$D25","v":1550.3149999999998},{"$f":"J33","v":1550.3149999999998},1715.6819333333333,1740.0661676338727,1,1]
["Ø110 mm < Ledningsnet ≤ Ø 250 mm","meter",{"$f":"Genanskaffelsespriser!E26","v":75},0,null,419.65036913292101,0,"Ny data","Nye råvandsledninger",{"$f":"Genanskaffelsespriser!$D26","v":2273.1039999999998},{"$f":"J34","v":2273.1039999999998},"",12718.78576903359,1,1]
["Ø 250 mm < Ledningsnet ≤ Ø 500mm","meter",{"$f":"Genanskaffelsespriser!E27","v":75},0,null,null,0,"",null,{"$f":"Genanskaffelsespriser!$D27","v":3912.6009999999997},3912.6009999999997,"","",1,1]
["Ledningsnet > Ø 500 mm","meter",{"$f":"Genanskaffelsespriser!E28","v":75},0,null,null,0,"",null,{"$f":"Genanskaffelsespriser!$D28","v":6981.0839999999998},6981.0839999999998,"","",1,1]
["Vandværk 1"]
["Beluftningsanlæg, iltningstrappe, Konstruktioner","m³/h ",{"$f":"Genanskaffelsespriser!$E$30","v":50},90,90,90,0,0,null,{"$f":"IF(E38=0,\"Variabel pris\",IFERROR((HLOOKUP(E38,'Variable priser'!$C$6:$H$16,2)+(E38-HLOOKUP(E38,'Variable priser'!$C$6:$H$16,1))*HLOOKUP(E38,'Variable priser'!$C$6:$H$16,3))/E38*'Variable priser'!$K$7*(1+Genanskaffelsespriser!$D$203),\"Fejl\"))","v":3730.1488418133331},{"$f":"IF(F38=0,\"Variabel pris\",IFERROR((HLOOKUP(F38,'Variable priser'!$C$6:$H$16,2)+(F38-HLOOKUP(F38,'Variable priser'!$C$6:$H$16,1))*HLOOKUP(F38,'Variable priser'!$C$6:$H$16,3))/F38*'Variable priser'!$K$7*(1+Genanskaffelsespriser!$D$203),\"Fejl\"))","v":3730.1488418133331},{"$f":"IF(ISBLANK(E38),\"\",IF(E38=0,\"\",IF(ISNUMBER(E38),((J38*E38)/C38)*N38,\"\")))","v":6714.2679152639994},{"$f":"IF(ISBLANK(F38),\"\",IF(F38=0,\"\",IF(ISNUMBER(F38),((K38*F38)/C38)*N38,\"\")))","v":6714.2679152639994},1,1]
["Beluftningsanlæg, iltningstrappe, Mek./EL","m³/h ",{"$f":"Genanskaffelsespriser!$E$31","v":25},90,90,90,0,0,null,{"$f":"IF(E39=0,\"Variabel pris\",IFERROR((HLOOKUP(E39,'Variable priser'!$C$6:$H$16,2)+(E39-HLOOKUP(E39,'Variable priser'!$C$6:$H$16,1))*HLOOKUP(E39,'Variable priser'!$C$6:$H$16,3))/E39*'Variable priser'!$L$7*(1+Genanskaffelsespriser!$D$203),\"Fejl\"))","v":932.53721045333327},{"$f":"IF(F39=0,\"Variabel pris\",IFERROR((HLOOKUP(F39,'Variable priser'!$C$6:$H$16,2)+(F39-HLOOKUP(F39,'Variable priser'!$C$6:$H$16,1))*HLOOKUP(F39,'Variable priser'!$C$6:$H$16,3))/F39*'Variable priser'!$L$7*(1+Genanskaffelsespriser!$D$203),\"Fejl\"))","v":932.53721045333327},{"$f":"IF(ISBLANK(E39),\"\",IF(E39=0,\"\",IF(ISNUMBER(E39),((J39*E39)/C39)*N39,\"\")))","v":3357.1339576319997},{"$f":"IF(ISBLANK(F39),\"\",IF(F39=0,\"\",IF(ISNUMBER(F39),((K39*F39)/C39)*N39,\"\")))","v":3357.1339576319997},1,1]
["Beluftningsanlæg, ika-beluftning, Konstruktioner","m³/h ",{"$f":"Genanskaffelsespriser!$E$32","v":50},0,0,0,0,0,null,{"$f":"IF(E40=0,\"Variabel pris\",IFERROR((HLOOKUP(E40,'Variable priser'!$C$6:$H$16,4)+(E40-HLOOKUP(E40,'Variable priser'!$C$6:$H$16,1))*HLOOKUP(E40,'Variable priser'!$C$6:$H$16,5))/E40*'Variable priser'!$K$9*(1+Genanskaffelsespriser!$D$203),\"Fejl\"))","v":"Variabel pris"},{"$f":"IF(F40=0,\"Variabel pris\",IFERROR((HLOOKUP(F40,'Variable priser'!$C$6:$H$16,4)+(F40-HLOOKUP(F40,'Variable priser'!$C$6:$H$16,1))*HLOOKUP(F40,'Variable priser'!$C$6:$H$16,5))/F40*'Variable priser'!$K$9*(1+Genanskaffelsespriser!$D$203),\"Fejl\"))","v":"Variabel pris"},"","",1,1]
["Beluftningsanlæg, ika-beluftning, Mek./EL","m³/h ",{"$f":"Genanskaffelsespriser!$E$33","v":25},0,0,0,0,0,null,{"$f":"IF(E41=0,\"Variabel pris\",IFERROR((HLOOKUP(E41,'Variable priser'!$C$6:$H$16,4)+(E41-HLOOKUP(E41,'Variable priser'!$C$6:$H$16,1))*HLOOKUP(E41,'Variable priser'!$C$6:$H$16,5))/E41*'Variable priser'!$L$9*(1+Genanskaffelsespriser!$D$203),\"Fejl\"))","v":"Variabel pris"},{"$f":"IF(F41=0,\"Variabel pris\",IFERROR((HLOOKUP(F41,'Variable priser'!$C$6:$H$16,4)+(F41-HLOOKUP(F41,'Variable priser'!$C$6:$H$16,1))*HLOOKUP(F41,'Variable priser'!$C$6:$H$16,5))/F41*'Variable priser'!$L$9*(1+Genanskaffelsespriser!$D$203),\"Fejl\"))","v":"Variabel pris"},"","",1,1]
["Beluftningsanlæg, bundbeluftbning, Konstruktioner","m³/h ",{"$f":"Genanskaffelsespriser!$E$34","v":50},0,0,0,0,0,null,{"$f":"IF(E42=0,\"Variabel pris\",IFERROR((HLOOKUP(E42,'Variable priser'!$C$6:$H$16,6)+(E42-HLOOKUP(E42,'Variable priser'!$C$6:$H$16,1))*HLOOKUP(E42,'Variable priser'!$C$6:$H$16,7))/E42*'Variable priser'!$K$17*(1+Genanskaffelsespriser!$D$203),\"Fejl\"))","v":"Variabel pris"},{"$f":"IF(F42=0,\"Variabel pris\",IFERROR((HLOOKUP(F42,'Variable priser'!$C$6:$H$16,6)+(F42-HLOOKUP(F42,'Variable priser'!$C$6:$H$16,1))*HLOOKUP(F42,'Variable priser'!$C$6:$H$16,7))/F42*'Variable priser'!$K$17*(1+Genanskaffelsespriser!$D$203),\"Fejl\"))","v":"Variabel pris"},"","",1,1]
["Beluftningsanlæg, bundbeluftbning, Mek./EL","m³/h ",{"$f":"Genanskaffelsespriser!$E$35","v":25},0,0,0,0,0,null,{"$f":"IF(E43=0,\"Variabel pris\",IFERROR((HLOOKUP(E43,'Variable priser'!$C$6:$H$16,6)+(E43-HLOOKUP(E43,'Variable priser'!$C$6:$H$16,1))*HLOOKUP(E43,'Variable priser'!$C$6:$H$16,7))/E43*'Variable priser'!$L$17*(1+Genanskaffelsespriser!$D$203),\"Fejl\"))","v":"Variabel pris"},{"$f":"IF(F43=0,\"Variabel pris\",IFERROR((HLOOKUP(F43,'Variable priser'!$C$6:$H$16,6)+(F43-HLOOKUP(F43,'Variable priser'!$C$6:$H$16,1))*HLOOKUP(F43,'Variable priser'!$C$6:$H$16,7))/F43*'Variable priser'!$L$17*(1+Genanskaffelsespriser!$D$203),\"Fejl\"))","v":"Variabel pris"},"","",1,1]
["Beluftningsanlæg, rislebakke, Konstruktioner","m³/h ",{"$f":"Genanskaffelsespriser!$E$36","v":50},0,0,0,0,0,null,{"$f":"IF(E44=0,\"Variabel pris\",IFERROR((HLOOKUP(E44,'Variable priser'!$C$6:$H$18,12)+(E44-HLOOKUP(E44,'Variable priser'!$C$6:$H$18,1))*HLOOKUP(E44,'Variable priser'!$C$6:$H$18,13))/E44*'Variable priser'!$K$17*(1+Genanskaffelsespriser!$D$203),\"Fejl\"))","v":"Variabel pris"},{"$f":"IF(F44=0,\"Variabel pris\",IFERROR((HLOOKUP(F44,'Variable priser'!$C$6:$H$18,12)+(F44-HLOOKUP(F44,'Variable priser'!$C$6:$H$18,1))*HLOOKUP(F44,'Variable priser'!$C$6:$H$18,13))/F44*'Variable priser'!$K$17*(1+Genanskaffelsespriser!$D$203),\"Fejl\"))","v":"Variabel pris"},"","",1,1]
["Beluftningsanlæg, rislebakke, Mek./EL","m³/h ",{"$f":"Genanskaffelsespriser!$E$37","v":25},0,0,0,0,0,null,{"$f":"IF(E45=0,\"Variabel pris\",IFERROR((HLOOKUP(E45,'Variable priser'!$C$6:$H$18,12)+(E45-HLOOKUP(E45,'Variable priser'!$C$6:$H$18,1))*HLOOKUP(E45,'Variable priser'!$C$6:$H$18,13))/E45*'Variable priser'!$L$17*(1+Genanskaffelsespriser!$D$203),\"Fejl\"))","v":"Variabel pris"},{"$f":"IF(F45=0,\"Variabel pris\",IFERROR((HLOOKUP(F45,'Variable priser'!$C$6:$H$18,12)+(F45-HLOOKUP(F45,'Variable priser'!$C$6:$H$18,1))*HLOOKUP(F45,'Variable priser'!$C$6:$H$18,13))/F45*'Variable priser'!$L$17*(1+Genanskaffelsespriser!$D$203),\"Fejl\"))","v":"Variabel pris"},"","",1,1]
["Beluftningsanlæg, kompressorbeluftning","m³/h ",{"$f":"Genanskaffelsespriser!$E$38","v":25},0,0,0,0,0,null,{"$f":"IF(E46=0,\"Variabel pris\",IFERROR((HLOOKUP(E46,'Variable priser'!$C$6:$H$16,8)+(E46-HLOOKUP(E46,'Variable priser'!$C$6:$H$16,1))*HLOOKUP(E46,'Variable priser'!$C$6:$H$16,9))/E46*(1+Genanskaffelsespriser!$D$203),\"Fejl\"))","v":"Variabel pris"},{"$f":"IF(F46=0,\"Variabel pris\",IFERROR((HLOOKUP(F46,'Variable priser'!$C$6:$H$16,8)+(F46-HLOOKUP(F46,'Variable priser'!$C$6:$H$16,1))*HLOOKUP(F46,'Variable priser'!$C$6:$H$16,9))/F46*(1+Genanskaffelsespriser!$D$203),\"Fejl\"))","v":"Variabel pris"},"","",1,1]
["Beluftningsanlæg, ren ilt","m³/h ",{"$f":"Genanskaffelsespriser!$E$39","v":25},0,0,0,0,0,null,{"$f":"IF(E47=0,\"Variabel pris\",IFERROR((HLOOKUP(E47,'Variable priser'!$C$6:$H$16,10)+(E47-HLOOKUP(E47,'Variable priser'!$C$6:$H$16,1))*HLOOKUP(E47,'Variable priser'!$C$6:$H$16,11))/E47*(1+Genanskaffelsespriser!$D$203),\"Fejl\"))","v":"Variabel pris"},{"$f":"IF(F47=0,\"Variabel pris\",IFERROR((HLOOKUP(F47,'Variable priser'!$C$6:$H$16,10)+(F47-HLOOKUP(F47,'Variable priser'!$C$6:$H$16,1))*HLOOKUP(F47,'Variable priser'!$C$6:$H$16,11))/F47*(1+Genanskaffelsespriser!$D$203),\"Fejl\"))","v":"Variabel pris"},"","",1,1]
["Behandlingsanlæg, kalk anlæg","m³/h ",{"$f":"Genanskaffelsespriser!$E$40","v":25},0,0,0,0,0,null,{"$f":"IF(E48=0,\"Variabel pris\",IFERROR((HLOOKUP(E48,'Variable priser'!$C$20:$G$24,3)+(E48-HLOOKUP(E48,'Variable priser'!$C$20:$G$24,1))*HLOOKUP(E48,'Variable priser'!$C$20:$G$24,4))/E48*(1+Genanskaffelsespriser!$D$203),\"Fejl\"))","v":"Variabel pris"},{"$f":"IF(F48=0,\"Variabel pris\",IFERROR((HLOOKUP(F48,'Variable priser'!$C$20:$G$24,3)+(F48-HLOOKUP(F48,'Variable priser'!$C$20:$G$24,1))*HLOOKUP(F48,'Variable priser'!$C$20:$G$24,4))/F48*(1+Genanskaffelsespriser!$D$203),\"Fejl\"))","v":"Variabel pris"},"","",1,1]
["Behandlingsanlæg, luddosering","m³/h ",{"$f":"Genanskaffelsespriser!$E$41","v":25},0,0,0,0,0,null,{"$f":"IF(E49=0,\"Variabel pris\",IFERROR((HLOOKUP(E49,'Variable priser'!$C$20:$G$25,5)+(E49-HLOOKUP(E49,'Variable priser'!$C$20:$G$25,1))*HLOOKUP(E49,'Variable priser'!$C$20:$G$25,6))/E49*(1+Genanskaffelsespriser!$D$203),\"Fejl\"))","v":"Variabel pris"},{"$f":"IF(F49=0,\"Variabel pris\",IFERROR((HLOOKUP(F49,'Variable priser'!$C$20:$G$25,5)+(F49-HLOOKUP(F49,'Variable priser'!$C$20:$G$25,1))*HLOOKUP(F49,'Variable priser'!$C$20:$G$25,6))/F49*(1+Genanskaffelsespriser!$D$203),\"Fejl\"))","v":"Variabel pris"},"","",1,1]
["Filteranlæg, åbne filtre, enkelt filtrering, Konstruktioner","m³/h ",{"$f":"Genanskaffelsespriser!$E$42","v":50},0,0,0,0,0,null,{"$f":"IF(E50=0,\"Variabel pris\",IFERROR((HLOOKUP(E50,'Variable priser'!$C$28:$G$38,9)+(E50-HLOOKUP(E50,'Variable priser'!$C$28:$G$38,1))*HLOOKUP(E50,'Variable priser'!$C$28:$G$38,10))/E50*'Variable priser'!$K$31*(1+Genanskaffelsespriser!$D$203),\"Fejl\"))","v":"Variabel pris"},{"$f":"IF(F50=0,\"Variabel pris\",IFERROR((HLOOKUP(F50,'Variable priser'!$C$28:$G$38,9)+(F50-HLOOKUP(F50,'Variable priser'!$C$28:$G$38,1))*HLOOKUP(F50,'Variable priser'!$C$28:$G$38,10))/F50*'Variable priser'!$K$31*(1+Genanskaffelsespriser!$D$203),\"Fejl\"))","v":"Variabel pris"},"","",1,1]
["Filteranlæg, åbne filtre, enkelt filtrering, Mek./EL","m³/h ",{"$f":"Genanskaffelsespriser!$E$43","v":25},0,0,0,0,0,null,{"$f":"IF(E51=0,\"Variabel pris\",IFERROR((HLOOKUP(E51,'Variable priser'!$C$28:$G$38,9)+(E51-HLOOKUP(E51,'Variable priser'!$C$28:$G$38,1))*HLOOKUP(E51,'Variable priser'!$C$28:$G$38,10))/E51*'Variable priser'!$L$31*(1+Genanskaffelsespriser!$D$203),\"Fejl\"))","v":"Variabel pris"},{"$f":"IF(F51=0,\"Variabel pris\",IFERROR((HLOOKUP(F51,'Variable priser'!$C$28:$G$38,9)+(F51-HLOOKUP(F51,'Variable priser'!$C$28:$G$38,1))*HLOOKUP(F51,'Variable priser'!$C$28:$G$38,10))/F51*'Variable priser'!$L$31*(1+Genanskaffelsespriser!$D$203),\"Fejl\"))","v":"Variabel pris"},"","",1,1]
["Filteranlæg, åbne filtre, dobbelt filtrering, Konstruktioner","m³/h ",{"$f":"Genanskaffelsespriser!$E$44","v":50},90,90,90,0,0,null,{"$f":"IF(E52=0,\"Variabel pris\",IFERROR((HLOOKUP(E52,'Variable priser'!$C$28:$G$38,6)+(E52-HLOOKUP(E52,'Variable priser'!$C$28:$G$38,1))*HLOOKUP(E52,'Variable priser'!$C$28:$G$38,7))/E52*'Variable priser'!$K$31*(1+Genanskaffelsespriser!$D$203),\"Fejl\"))","v":11153.63584608},{"$f":"IF(F52=0,\"Variabel pris\",IFERROR((HLOOKUP(F52,'Variable priser'!$C$28:$G$38,6)+(F52-HLOOKUP(F52,'Variable priser'!$C$28:$G$38,1))*HLOOKUP(F52,'Variable priser'!$C$28:$G$38,7))/F52*'Variable priser'!$K$31*(1+Genanskaffelsespriser!$D$203),\"Fejl\"))","v":11153.63584608},20076.544522944001,20076.544522944001,1,1]
["Filteranlæg, åbne filtre, dobbelt filtrering, Mek./EL","m³/h ",{"$f":"Genanskaffelsespriser!$E$45","v":25},90,90,90,0,0,null,{"$f":"IF(E53=0,\"Variabel pris\",IFERROR((HLOOKUP(E53,'Variable priser'!$C$28:$G$38,6)+(E53-HLOOKUP(E53,'Variable priser'!$C$28:$G$38,1))*HLOOKUP(E53,'Variable priser'!$C$28:$G$38,7))/E53*'Variable priser'!$L$31*(1+Genanskaffelsespriser!$D$203),\"Fejl\"))","v":16730.453769119998},{"$f":"IF(F53=0,\"Variabel pris\",IFERROR((HLOOKUP(F53,'Variable priser'!$C$28:$G$38,6)+(F53-HLOOKUP(F53,'Variable priser'!$C$28:$G$38,1))*HLOOKUP(F53,'Variable priser'!$C$28:$G$38,7))/F53*'Variable priser'!$L$31*(1+Genanskaffelsespriser!$D$203),\"Fejl\"))","v":16730.453769119998},60229.633568831996,60229.633568831996,1,1]
["Filteranlæg, trykfiltre, enkelt filtrering","m³/h ",{"$f":"Genanskaffelsespriser!$E$46","v":25},0,0,0,0,0,null,{"$f":"IF(E54=0,\"Variabel pris\",IFERROR((HLOOKUP(E54,'Variable priser'!$C$40:$H$42,2)+(E54-HLOOKUP(E54,'Variable priser'!$C$40:$H$42,1))*HLOOKUP(E54,'Variable priser'!$C$40:$H$42,3))/E54*(1+Genanskaffelsespriser!$D$203),\"Fejl\"))","v":"Variabel pris"},{"$f":"IF(F54=0,\"Variabel pris\",IFERROR((HLOOKUP(F54,'Variable priser'!$C$40:$H$42,2)+(F54-HLOOKUP(F54,'Variable priser'!$C$40:$H$42,1))*HLOOKUP(F54,'Variable priser'!$C$40:$H$42,3))/F54*(1+Genanskaffelsespriser!$D$203),\"Fejl\"))","v":"Variabel pris"},"","",1,1]
["Filteranlæg, trykfiltre, dobbelt filtrering","m³/h ",{"$f":"Genanskaffelsespriser!$E$47","v":25},0,0,0,0,0,null,{"$f":"IF(E55=0,\"Variabel pris\",IFERROR((HLOOKUP(E55,'Variable priser'!$C$44:$H$46,2)+(E55-HLOOKUP(E55,'Variable priser'!$C$44:$H$46,1))*HLOOKUP(E55,'Variable priser'!$C$44:$H$46,3))/E55*(1+Genanskaffelsespriser!$D$203),\"Fejl\"))","v":"Variabel pris"},{"$f":"IF(F55=0,\"Variabel pris\",IFERROR((HLOOKUP(F55,'Variable priser'!$C$44:$H$46,2)+(F55-HLOOKUP(F55,'Variable priser'!$C$44:$H$46,1))*HLOOKUP(F55,'Variable priser'!$C$44:$H$46,3))/F55*(1+Genanskaffelsespriser!$D$203),\"Fejl\"))","v":"Variabel pris"},"","",1,1]
["Rentvandsbeholder  insitu støbt","m³",{"$f":"Genanskaffelsespriser!$E$48","v":50},1000,1000,1000,{"$f":"IF($D56=\"\",IF($E56>0,\"Ny data\",IF($E56=\"\",\"\",0)),IF($D56=0,IF($E56=0,0,\"Ny data\"),($E56-$D56)/$D56))","v":0},0,null,{"$f":"IF(E56=0,\"Variabel pris\",IFERROR((HLOOKUP(E56,'Variable priser'!$C$48:$H$50,2)+(E56-HLOOKUP(E56,'Variable priser'!$C$48:$H$50,1))*HLOOKUP(E56,'Variable priser'!$C$48:$H$50,3))/E56*(1+Genanskaffelsespriser!$D$203),\"Fejl\"))","v":4374.2008929599997},{"$f":"IF(F56=0,\"Variabel pris\",IFERROR((HLOOKUP(F56,'Variable priser'!$C$48:$H$50,2)+(F56-HLOOKUP(F56,'Variable priser'!$C$48:$H$50,1))*HLOOKUP(F56,'Variable priser'!$C$48:$H$50,3))/F56*(1+Genanskaffelsespriser!$D$203),\"Fejl\"))","v":4374.2008929599997},87484.017859200001,87484.017859200001,1,1]
["Rentvandsbeholder  element","m³",{"$f":"Genanskaffelsespriser!$E$49","v":50},0,0,0,0,0,null,{"$f":"IF(E57=0,\"Variabel pris\",IFERROR((HLOOKUP(E57,'Variable priser'!$C$52:$H$54,2)+(E57-HLOOKUP(E57,'Variable priser'!$C$52:$H$54,1))*HLOOKUP(E57,'Variable priser'!$C$52:$H$54,3))/E57*(1+Genanskaffelsespriser!$D$203),\"Fejl\"))","v":"Variabel pris"},{"$f":"IF(F57=0,\"Variabel pris\",IFERROR((HLOOKUP(F57,'Variable priser'!$C$52:$H$54,2)+(F57-HLOOKUP(F57,'Variable priser'!$C$52:$H$54,1))*HLOOKUP(F57,'Variable priser'!$C$52:$H$54,3))/F57*(1+Genanskaffelsespriser!$D$203),\"Fejl\"))","v":"Variabel pris"},"","",1,1]
["Udpumpningsanlæg, rentvandspumper på vandværk","m³/h ",{"$f":"Genanskaffelsespriser!$E$50","v":25},270,270,270,0,0,null,{"$f":"IF(E58=0,\"Variabel pris\",IFERROR((HLOOKUP(E58,'Variable priser'!$C$71:$H$73,2)+(E58-HLOOKUP(E58,'Variable priser'!$C$71:$H$73,1))*HLOOKUP(E58,'Variable priser'!$C$71:$H$73,3))/E58*(1+Genanskaffelsespriser!$D$203),\"Fejl\"))","v":1119.7455586419749},{"$f":"IF(F58=0,\"Variabel pris\",IFERROR((HLOOKUP(F58,'Variable priser'!$C$71:$H$73,2)+(F58-HLOOKUP(F58,'Variable priser'!$C$71:$H$73,1))*HLOOKUP(F58,'Variable priser'!$C$71:$H$73,3))/F58*(1+Genanskaffelsespriser!$D$203),\"Fejl\"))","v":1119.7455586419749},12093.252033333329,12093.252033333329,1,1]
["Udpumpningsanlæg, frekvensomformer","kW",{"$f":"Genanskaffelsespriser!$E$51","v":25},15,15,15,0,0,null,{"$f":"IF(E59=0,\"Variabel pris\",IFERROR((HLOOKUP(E59,'Variable priser'!$C$76:$J$78,2)+(E59-HLOOKUP(E59,'Variable priser'!$C$76:$J$78,1))*HLOOKUP(E59,'Variable priser'!$C$76:$J$78,3))/E59*(1+Genanskaffelsespriser!$D$203),\"Fejl\"))","v":6482.3201840000029},{"$f":"IF(F59=0,\"Variabel pris\",IFERROR((HLOOKUP(F59,'Variable priser'!$C$76:$J$78,2)+(F59-HLOOKUP(F59,'Variable priser'!$C$76:$J$78,1))*HLOOKUP(F59,'Variable priser'!$C$76:$J$78,3))/F59*(1+Genanskaffelsespriser!$D$203),\"Fejl\"))","v":6482.3201840000029},3889.3921104000019,3889.3921104000019,1,1]
["Udpumpningsanlæg, Hydrofor","liter",{"$f":"Genanskaffelsespriser!$E$52","v":25},0,0,0,0,0,null,{"$f":"IF(E60=0,\"Variabel pris\",IFERROR((HLOOKUP(E60,'Variable priser'!$C$81:$J$83,2)+(E60-HLOOKUP(E60,'Variable priser'!$C$81:$J$83,1))*HLOOKUP(E60,'Variable priser'!$C$81:$J$83,3))/E60*(1+Genanskaffelsespriser!$D$203),\"Fejl\"))","v":"Variabel pris"},{"$f":"IF(F60=0,\"Variabel pris\",IFERROR((HLOOKUP(F60,'Variable priser'!$C$81:$J$83,2)+(F60-HLOOKUP(F60,'Variable priser'!$C$81:$J$83,1))*HLOOKUP(F60,'Variable priser'!$C$81:$J$83,3))/F60*(1+Genanskaffelsespriser!$D$203),\"Fejl\"))","v":"Variabel pris"},"","",1,1]
["Skyllevand-/slamhåndteringsanlæg - lukkede betonbeholdere","m³",{"$f":"Genanskaffelsespriser!$E$53","v":50},50,50,50,0,0,null,{"$f":"IF(E61=0,\"Variabel pris\",IFERROR((HLOOKUP(E61,'Variable priser'!$C$59:$H$61,2)+(E61-HLOOKUP(E61,'Variable priser'!$C$59:$H$61,1))*HLOOKUP(E61,'Variable priser'!$C$59:$H$61,3))/E61*(1+Genanskaffelsespriser!$D$203),\"Fejl\"))","v":5400.2480159999986},{"$f":"IF(F61=0,\"Variabel pris\",IFERROR((HLOOKUP(F61,'Variable priser'!$C$59:$H$61,2)+(F61-HLOOKUP(F61,'Variable priser'!$C$59:$H$61,1))*HLOOKUP(F61,'Variable priser'!$C$59:$H$61,3))/F61*(1+Genanskaffelsespriser!$D$203),\"Fejl\"))","v":5400.2480159999986},5400.2480159999986,5400.2480159999986,1,1]
["Skyllevand-/slamhåndteringsanl. - åbne med faste sider/bund","m³",{"$f":"Genanskaffelsespriser!$E$54","v":50},0,0,0,0,0,null,{"$f":"IF(E62=0,\"Variabel pris\",IFERROR((HLOOKUP(E62,'Variable priser'!$C$59:$H$64,5)+(E62-HLOOKUP(E62,'Variable priser'!$C$59:$H$64,1))*HLOOKUP(E62,'Variable priser'!$C$59:$H$64,6))/E62*(1+Genanskaffelsespriser!$D$203),\"Fejl\"))","v":"Variabel pris"},{"$f":"IF(F62=0,\"Variabel pris\",IFERROR((HLOOKUP(F62,'Variable priser'!$C$59:$H$64,5)+(F62-HLOOKUP(F62,'Variable priser'!$C$59:$H$64,1))*HLOOKUP(F62,'Variable priser'!$C$59:$H$64,6))/F62*(1+Genanskaffelsespriser!$D$203),\"Fejl\"))","v":"Variabel pris"},"","",1,1]
["Skyllevand-/slamhåndteringsanlæg - jordbassiner","m³",{"$f":"Genanskaffelsespriser!$E$55","v":50},0,0,0,0,0,null,{"$f":"IF(E63=0,\"Variabel pris\",IFERROR((HLOOKUP(E63,'Variable priser'!$C$59:$H$67,8)+(E63-HLOOKUP(E63,'Variable priser'!$C$59:$H$67,1))*HLOOKUP(E63,'Variable priser'!$C$59:$H$67,9))/E63*(1+Genanskaffelsespriser!$D$203),\"Fejl\"))","v":"Variabel pris"},{"$f":"IF(F63=0,\"Variabel pris\",IFERROR((HLOOKUP(F63,'Variable priser'!$C$59:$H$67,8)+(F63-HLOOKUP(F63,'Variable priser'!$C$59:$H$67,1))*HLOOKUP(F63,'Variable priser'!$C$59:$H$67,9))/F63*(1+Genanskaffelsespriser!$D$203),\"Fejl\"))","v":"Variabel pris"},"","",1,1]
["Skyllevandsbehandling, inkl. UV-filter mv., Mek./EL","m³/h.",{"$f":"Genanskaffelsespriser!$E$56","v":25},5,5,5,0,0,null,{"$f":"IF(E64=0,\"Variabel pris\",IFERROR((HLOOKUP(E64,'Variable priser'!$C$108:$E$110,2)+(E64-HLOOKUP(E64,'Variable priser'!$C$108:$E$110,1))*HLOOKUP(E64,'Variable priser'!$C$108:$E$110,3))/E64*'Variable priser'!$H$109*(1+Genanskaffelsespriser!$D$203),\"Fejl\"))","v":22725.411682499998},{"$f":"IF(F64=0,\"Variabel pris\",IFERROR((HLOOKUP(F64,'Variable priser'!$C$108:$E$110,2)+(F64-HLOOKUP(F64,'Variable priser'!$C$108:$E$110,1))*HLOOKUP(F64,'Variable priser'!$C$108:$E$110,3))/F64*'Variable priser'!$H$109*(1+Genanskaffelsespriser!$D$203),\"Fejl\"))","v":22725.411682499998},4545.0823364999997,4545.0823364999997,1,1]
["Skyllevandsbehandling, inkl. UV-filter mv., SRO","m³/h.",{"$f":"Genanskaffelsespriser!$E$57","v":10},5,5,5,0,0,null,{"$f":"IF(E65=0,\"Variabel pris\",IFERROR((HLOOKUP(E65,'Variable priser'!$C$108:$E$110,2)+(E65-HLOOKUP(E65,'Variable priser'!$C$108:$E$110,1))*HLOOKUP(E65,'Variable priser'!$C$108:$E$110,3))/E65*'Variable priser'!$I$109*(1+Genanskaffelsespriser!$D$203),\"Fejl\"))","v":4010.3667674999992},{"$f":"IF(F65=0,\"Variabel pris\",IFERROR((HLOOKUP(F65,'Variable priser'!$C$108:$E$110,2)+(F65-HLOOKUP(F65,'Variable priser'!$C$108:$E$110,1))*HLOOKUP(F65,'Variable priser'!$C$108:$E$110,3))/F65*'Variable priser'!$I$109*(1+Genanskaffelsespriser!$D$203),\"Fejl\"))","v":4010.3667674999992},2005.1833837499994,2005.1833837499994,1,1]
["Nødstrømsanlæg på vandværk","kW",{"$f":"Genanskaffelsespriser!$E$58","v":25},0,0,0,0,0,null,{"$f":"IF(E66=0,\"Variabel pris\",IFERROR((HLOOKUP(E66,'Variable priser'!$C$86:$H$88,2)+(E66-HLOOKUP(E66,'Variable priser'!$C$86:$H$88,1))*HLOOKUP(E66,'Variable priser'!$C$86:$H$88,3))/E66*(1+Genanskaffelsespriser!$D$203),\"Fejl\"))","v":"Variabel pris"},{"$f":"IF(F66=0,\"Variabel pris\",IFERROR((HLOOKUP(F66,'Variable priser'!$C$86:$H$88,2)+(F66-HLOOKUP(F66,'Variable priser'!$C$86:$H$88,1))*HLOOKUP(F66,'Variable priser'!$C$86:$H$88,3))/F66*(1+Genanskaffelsespriser!$D$203),\"Fejl\"))","v":"Variabel pris"},"","",1,1]
["Elanlæg og SRO-anlæg - vandværk, Elanlæg","m³/h.",{"$f":"Genanskaffelsespriser!$E$59","v":25},90,90,90,0,0,null,{"$f":"IF(E67=0,\"Variabel pris\",IFERROR((HLOOKUP(E67,'Variable priser'!$C$91:$J$95,4)+(E67-HLOOKUP(E67,'Variable priser'!$C$91:$J$95,1))*HLOOKUP(E67,'Variable priser'!$C$91:$J$95,5))/E67*(1+Genanskaffelsespriser!$D$203),\"Fejl\"))","v":5258.6684799999994},{"$f":"IF(F67=0,\"Variabel pris\",IFERROR((HLOOKUP(F67,'Variable priser'!$C$91:$J$95,4)+(F67-HLOOKUP(F67,'Variable priser'!$C$91:$J$95,1))*HLOOKUP(F67,'Variable priser'!$C$91:$J$95,5))/F67*(1+Genanskaffelsespriser!$D$203),\"Fejl\"))","v":5258.6684799999994},18931.206527999999,18931.206527999999,1,1]
["Elanlæg og SRO-anlæg - vandværk, SRO","m³/h.",{"$f":"Genanskaffelsespriser!$E$60","v":10},90,90,90,0,0,null,{"$f":"IF(E68=0,\"Variabel pris\",IFERROR((HLOOKUP(E68,'Variable priser'!$C$91:$J$98,7)+(E68-HLOOKUP(E68,'Variable priser'!$C$91:$J$98,1))*HLOOKUP(E68,'Variable priser'!$C$91:$J$98,8))/E68*(1+Genanskaffelsespriser!$D$203),\"Fejl\"))","v":3550.724871111111},{"$f":"IF(F68=0,\"Variabel pris\",IFERROR((HLOOKUP(F68,'Variable priser'!$C$91:$J$98,7)+(F68-HLOOKUP(F68,'Variable priser'!$C$91:$J$98,1))*HLOOKUP(F68,'Variable priser'!$C$91:$J$98,8))/F68*(1+Genanskaffelsespriser!$D$203),\"Fejl\"))","v":3550.724871111111},31956.523839999998,31956.523839999998,1,1]
["Vandværk 2"]
["Beluftningsanlæg, iltningstrappe, Konstruktioner","m³/h ",{"$f":"Genanskaffelsespriser!$E$30","v":50},0,0,0,0,{"$f":"IF($E70=\"\",IF($F70>0,\"Ny data\",IF($F70=\"\",\"\",0)),IF($E70=0,IF($F70=0,0,\"Ny data\"),($F70-$E70)/$E70))","v":0},null,{"$f":"IF(E70=0,\"Variabel pris\",IFERROR((HLOOKUP(E70,'Variable priser'!$C$6:$H$16,2)+(E70-HLOOKUP(E70,'Variable priser'!$C$6:$H$16,1))*HLOOKUP(E70,'Variable priser'!$C$6:$H$16,3))/E70*'Variable priser'!$K$7*(1+Genanskaffelsespriser!$D$203),\"Fejl\"))","v":"Variabel pris"},{"$f":"IF(F70=0,\"Variabel pris\",IFERROR((HLOOKUP(F70,'Variable priser'!$C$6:$H$16,2)+(F70-HLOOKUP(F70,'Variable priser'!$C$6:$H$16,1))*HLOOKUP(F70,'Variable priser'!$C$6:$H$16,3))/F70*'Variable priser'!$K$7*(1+Genanskaffelsespriser!$D$203),\"Fejl\"))","v":"Variabel pris"},{"$f":"IF(ISBLANK(E70),\"\",IF(E70=0,\"\",IF(ISNUMBER(E70),((J70*E70)/C70)*N70,\"\")))","v":""},{"$f":"IF(ISBLANK(F70),\"\",IF(F70=0,\"\",IF(ISNUMBER(F70),((K70*F70)/C70)*N70,\"\")))","v":""},1,1]
["Beluftningsanlæg, iltningstrappe, Mek./EL","m³/h ",{"$f":"Genanskaffelsespriser!$E$31","v":25},0,0,0,0,0,null,{"$f":"IF(E71=0,\"Variabel pris\",IFERROR((HLOOKUP(E71,'Variable priser'!$C$6:$H$16,2)+(E71-HLOOKUP(E71,'Variable priser'!$C$6:$H$16,1))*HLOOKUP(E71,'Variable priser'!$C$6:$H$16,3))/E71*'Variable priser'!$L$7*(1+Genanskaffelsespriser!$D$203),\"Fejl\"))","v":"Variabel pris"},{"$f":"IF(F71=0,\"Variabel pris\",IFERROR((HLOOKUP(F71,'Variable priser'!$C$6:$H$16,2)+(F71-HLOOKUP(F71,'Variable priser'!$C$6:$H$16,1))*HLOOKUP(F71,'Variable priser'!$C$6:$H$16,3))/F71*'Variable priser'!$L$7*(1+Genanskaffelsespriser!$D$203),\"Fejl\"))","v":"Variabel pris"},{"$f":"IF(ISBLANK(E71),\"\",IF(E71=0,\"\",IF(ISNUMBER(E71),((J71*E71)/C71)*N71,\"\")))","v":""},{"$f":"IF(ISBLANK(F71),\"\",IF(F71=0,\"\",IF(ISNUMBER(F71),((K71*F71)/C71)*N71,\"\")))","v":""},1,1]
["Beluftningsanlæg, ika-beluftning, Konstruktioner","m³/h ",{"$f":"Genanskaffelsespriser!$E$32","v":50},0,0,0,0,0,null,{"$f":"IF(E72=0,\"Variabel pris\",IFERROR((HLOOKUP(E72,'Variable priser'!$C$6:$H$16,4)+(E72-HLOOKUP(E72,'Variable priser'!$C$6:$H$16,1))*HLOOKUP(E72,'Variable priser'!$C$6:$H$16,5))/E72*'Variable priser'!$K$9*(1+Genanskaffelsespriser!$D$203),\"Fejl\"))","v":"Variabel pris"},{"$f":"IF(F72=0,\"Variabel pris\",IFERROR((HLOOKUP(F72,'Variable priser'!$C$6:$H$16,4)+(F72-HLOOKUP(F72,'Variable priser'!$C$6:$H$16,1))*HLOOKUP(F72,'Variable priser'!$C$6:$H$16,5))/F72*'Variable priser'!$K$9*(1+Genanskaffelsespriser!$D$203),\"Fejl\"))","v":"Variabel pris"},"","",1,1]
["Beluftningsanlæg, ika-beluftning, Mek./EL","m³/h ",{"$f":"Genanskaffelsespriser!$E$33","v":25},0,0,0,0,0,null,{"$f":"IF(E73=0,\"Variabel pris\",IFERROR((HLOOKUP(E73,'Variable priser'!$C$6:$H$16,4)+(E73-HLOOKUP(E73,'Variable priser'!$C$6:$H$16,1))*HLOOKUP(E73,'Variable priser'!$C$6:$H$16,5))/E73*'Variable priser'!$L$9*(1+Genanskaffelsespriser!$D$203),\"Fejl\"))","v":"Variabel pris"},{"$f":"IF(F73=0,\"Variabel pris\",IFERROR((HLOOKUP(F73,'Variable priser'!$C$6:$H$16,4)+(F73-HLOOKUP(F73,'Variable priser'!$C$6:$H$16,1))*HLOOKUP(F73,'Variable priser'!$C$6:$H$16,5))/F73*'Variable priser'!$L$9*(1+Genanskaffelsespriser!$D$203),\"Fejl\"))","v":"Variabel pris"},"","",1,1]
["Beluftningsanlæg, bundbeluftbning, Konstruktioner","m³/h ",{"$f":"Genanskaffelsespriser!$E$34","v":50},0,0,0,0,0,null,{"$f":"IF(E74=0,\"Variabel pris\",IFERROR((HLOOKUP(E74,'Variable priser'!$C$6:$H$16,6)+(E74-HLOOKUP(E74,'Variable priser'!$C$6:$H$16,1))*HLOOKUP(E74,'Variable priser'!$C$6:$H$16,7))/E74*'Variable priser'!$K$17*(1+Genanskaffelsespriser!$D$203),\"Fejl\"))","v":"Variabel pris"},{"$f":"IF(F74=0,\"Variabel pris\",IFERROR((HLOOKUP(F74,'Variable priser'!$C$6:$H$16,6)+(F74-HLOOKUP(F74,'Variable priser'!$C$6:$H$16,1))*HLOOKUP(F74,'Variable priser'!$C$6:$H$16,7))/F74*'Variable priser'!$K$17*(1+Genanskaffelsespriser!$D$203),\"Fejl\"))","v":"Variabel pris"},"","",1,1]
["Beluftningsanlæg, bundbeluftbning, Mek./EL","m³/h ",{"$f":"Genanskaffelsespriser!$E$35","v":25},0,0,0,0,0,null,{"$f":"IF(E75=0,\"Variabel pris\",IFERROR((HLOOKUP(E75,'Variable priser'!$C$6:$H$16,6)+(E75-HLOOKUP(E75,'Variable priser'!$C$6:$H$16,1))*HLOOKUP(E75,'Variable priser'!$C$6:$H$16,7))/E75*'Variable priser'!$L$17*(1+Genanskaffelsespriser!$D$203),\"Fejl\"))","v":"Variabel pris"},{"$f":"IF(F75=0,\"Variabel pris\",IFERROR((HLOOKUP(F75,'Variable priser'!$C$6:$H$16,6)+(F75-HLOOKUP(F75,'Variable priser'!$C$6:$H$16,1))*HLOOKUP(F75,'Variable priser'!$C$6:$H$16,7))/F75*'Variable priser'!$L$17*(1+Genanskaffelsespriser!$D$203),\"Fejl\"))","v":"Variabel pris"},"","",1,1]
["Beluftningsanlæg, rislebakke, Konstruktioner","m³/h ",{"$f":"Genanskaffelsespriser!$E$36","v":50},44,44,44,0,0,null,{"$f":"IF(E76=0,\"Variabel pris\",IFERROR((HLOOKUP(E76,'Variable priser'!$C$6:$H$18,12)+(E76-HLOOKUP(E76,'Variable priser'!$C$6:$H$18,1))*HLOOKUP(E76,'Variable priser'!$C$6:$H$18,13))/E76*'Variable priser'!$K$17*(1+Genanskaffelsespriser!$D$203),\"Fejl\"))","v":2326.9787296789082},{"$f":"IF(F76=0,\"Variabel pris\",IFERROR((HLOOKUP(F76,'Variable priser'!$C$6:$H$18,12)+(F76-HLOOKUP(F76,'Variable priser'!$C$6:$H$18,1))*HLOOKUP(F76,'Variable priser'!$C$6:$H$18,13))/F76*'Variable priser'!$K$17*(1+Genanskaffelsespriser!$D$203),\"Fejl\"))","v":2326.9787296789082},2047.7412821174394,2047.7412821174394,1,1]
["Beluftningsanlæg, rislebakke, Mek./EL","m³/h ",{"$f":"Genanskaffelsespriser!$E$37","v":25},44,44,44,0,0,null,{"$f":"IF(E77=0,\"Variabel pris\",IFERROR((HLOOKUP(E77,'Variable priser'!$C$6:$H$18,12)+(E77-HLOOKUP(E77,'Variable priser'!$C$6:$H$18,1))*HLOOKUP(E77,'Variable priser'!$C$6:$H$18,13))/E77*'Variable priser'!$L$17*(1+Genanskaffelsespriser!$D$203),\"Fejl\"))","v":997.27659843381787},{"$f":"IF(F77=0,\"Variabel pris\",IFERROR((HLOOKUP(F77,'Variable priser'!$C$6:$H$18,12)+(F77-HLOOKUP(F77,'Variable priser'!$C$6:$H$18,1))*HLOOKUP(F77,'Variable priser'!$C$6:$H$18,13))/F77*'Variable priser'!$L$17*(1+Genanskaffelsespriser!$D$203),\"Fejl\"))","v":997.27659843381787},1755.2068132435195,1755.2068132435195,1,1]
["Beluftningsanlæg, kompressorbeluftning","m³/h ",{"$f":"Genanskaffelsespriser!$E$38","v":25},0,0,0,0,0,null,{"$f":"IF(E78=0,\"Variabel pris\",IFERROR((HLOOKUP(E78,'Variable priser'!$C$6:$H$16,8)+(E78-HLOOKUP(E78,'Variable priser'!$C$6:$H$16,1))*HLOOKUP(E78,'Variable priser'!$C$6:$H$16,9))/E78*(1+Genanskaffelsespriser!$D$203),\"Fejl\"))","v":"Variabel pris"},{"$f":"IF(F78=0,\"Variabel pris\",IFERROR((HLOOKUP(F78,'Variable priser'!$C$6:$H$16,8)+(F78-HLOOKUP(F78,'Variable priser'!$C$6:$H$16,1))*HLOOKUP(F78,'Variable priser'!$C$6:$H$16,9))/F78*(1+Genanskaffelsespriser!$D$203),\"Fejl\"))","v":"Variabel pris"},"","",1,1]
["Beluftningsanlæg, ren ilt","m³/h ",{"$f":"Genanskaffelsespriser!$E$39","v":25},0,0,0,0,0,null,{"$f":"IF(E79=0,\"Variabel pris\",IFERROR((HLOOKUP(E79,'Variable priser'!$C$6:$H$16,10)+(E79-HLOOKUP(E79,'Variable priser'!$C$6:$H$16,1))*HLOOKUP(E79,'Variable priser'!$C$6:$H$16,11))/E79*(1+Genanskaffelsespriser!$D$203),\"Fejl\"))","v":"Variabel pris"},{"$f":"IF(F79=0,\"Variabel pris\",IFERROR((HLOOKUP(F79,'Variable priser'!$C$6:$H$16,10)+(F79-HLOOKUP(F79,'Variable priser'!$C$6:$H$16,1))*HLOOKUP(F79,'Variable priser'!$C$6:$H$16,11))/F79*(1+Genanskaffelsespriser!$D$203),\"Fejl\"))","v":"Variabel pris"},"","",1,1]
["Behandlingsanlæg, kalk anlæg","m³/h ",{"$f":"Genanskaffelsespriser!$E$40","v":25},0,0,0,0,0,null,{"$f":"IF(E80=0,\"Variabel pris\",IFERROR((HLOOKUP(E80,'Variable priser'!$C$20:$G$24,3)+(E80-HLOOKUP(E80,'Variable priser'!$C$20:$G$24,1))*HLOOKUP(E80,'Variable priser'!$C$20:$G$24,4))/E80*(1+Genanskaffelsespriser!$D$203),\"Fejl\"))","v":"Variabel pris"},{"$f":"IF(F80=0,\"Variabel pris\",IFERROR((HLOOKUP(F80,'Variable priser'!$C$20:$G$24,3)+(F80-HLOOKUP(F80,'Variable priser'!$C$20:$G$24,1))*HLOOKUP(F80,'Variable priser'!$C$20:$G$24,4))/F80*(1+Genanskaffelsespriser!$D$203),\"Fejl\"))","v":"Variabel pris"},"","",1,1]
["Behandlingsanlæg, luddosering","m³/h ",{"$f":"Genanskaffelsespriser!$E$41","v":25},0,0,0,0,0,null,{"$f":"IF(E81=0,\"Variabel pris\",IFERROR((HLOOKUP(E81,'Variable priser'!$C$20:$G$25,5)+(E81-HLOOKUP(E81,'Variable priser'!$C$20:$G$25,1))*HLOOKUP(E81,'Variable priser'!$C$20:$G$25,6))/E81*(1+Genanskaffelsespriser!$D$203),\"Fejl\"))","v":"Variabel pris"},{"$f":"IF(F81=0,\"Variabel pris\",IFERROR((HLOOKUP(F81,'Variable priser'!$C$20:$G$25,5)+(F81-HLOOKUP(F81,'Variable priser'!$C$20:$G$25,1))*HLOOKUP(F81,'Variable priser'!$C$20:$G$25,6))/F81*(1+Genanskaffelsespriser!$D$203),\"Fejl\"))","v":"Variabel pris"},"","",1,1]
["Filteranlæg, åbne filtre, enkelt filtrering, Konstruktioner","m³/h ",{"$f":"Genanskaffelsespriser!$E$42","v":50},0,0,0,0,0,null,{"$f":"IF(E82=0,\"Variabel pris\",IFERROR((HLOOKUP(E82,'Variable priser'!$C$28:$G$38,9)+(E82-HLOOKUP(E82,'Variable priser'!$C$28:$G$38,1))*HLOOKUP(E82,'Variable priser'!$C$28:$G$38,10))/E82*'Variable priser'!$K$31*(1+Genanskaffelsespriser!$D$203),\"Fejl\"))","v":"Variabel pris"},{"$f":"IF(F82=0,\"Variabel pris\",IFERROR((HLOOKUP(F82,'Variable priser'!$C$28:$G$38,9)+(F82-HLOOKUP(F82,'Variable priser'!$C$28:$G$38,1))*HLOOKUP(F82,'Variable priser'!$C$28:$G$38,10))/F82*'Variable priser'!$K$31*(1+Genanskaffelsespriser!$D$203),\"Fejl\"))","v":"Variabel pris"},"","",1,1]
["Filteranlæg, åbne filtre, enkelt filtrering, Mek./EL","m³/h ",{"$f":"Genanskaffelsespriser!$E$43","v":25},0,0,0,0,0,null,{"$f":"IF(E83=0,\"Variabel pris\",IFERROR((HLOOKUP(E83,'Variable priser'!$C$28:$G$38,9)+(E83-HLOOKUP(E83,'Variable priser'!$C$28:$G$38,1))*HLOOKUP(E83,'Variable priser'!$C$28:$G$38,10))/E83*'Variable priser'!$L$31*(1+Genanskaffelsespriser!$D$203),\"Fejl\"))","v":"Variabel pris"},{"$f":"IF(F83=0,\"Variabel pris\",IFERROR((HLOOKUP(F83,'Variable priser'!$C$28:$G$38,9)+(F83-HLOOKUP(F83,'Variable priser'!$C$28:$G$38,1))*HLOOKUP(F83,'Variable priser'!$C$28:$G$38,10))/F83*'Variable priser'!$L$31*(1+Genanskaffelsespriser!$D$203),\"Fejl\"))","v":"Variabel pris"},"","",1,1]
["Filteranlæg, åbne filtre, dobbelt filtrering, Konstruktioner","m³/h ",{"$f":"Genanskaffelsespriser!$E$44","v":50},44,44,44,0,0,null,{"$f":"IF(E84=0,\"Variabel pris\",IFERROR((HLOOKUP(E84,'Variable priser'!$C$28:$G$38,6)+(E84-HLOOKUP(E84,'Variable priser'!$C$28:$G$38,1))*HLOOKUP(E84,'Variable priser'!$C$28:$G$38,7))/E84*'Variable priser'!$K$31*(1+Genanskaffelsespriser!$D$203),\"Fejl\"))","v":12869.579822399997},{"$f":"IF(F84=0,\"Variabel pris\",IFERROR((HLOOKUP(F84,'Variable priser'!$C$28:$G$38,6)+(F84-HLOOKUP(F84,'Variable priser'!$C$28:$G$38,1))*HLOOKUP(F84,'Variable priser'!$C$28:$G$38,7))/F84*'Variable priser'!$K$31*(1+Genanskaffelsespriser!$D$203),\"Fejl\"))","v":12869.579822399997},11325.230243711998,11325.230243711998,1,1]
["Filteranlæg, åbne filtre, dobbelt filtrering, Mek./EL","m³/h ",{"$f":"Genanskaffelsespriser!$E$45","v":25},44,44,44,0,0,null,{"$f":"IF(E85=0,\"Variabel pris\",IFERROR((HLOOKUP(E85,'Variable priser'!$C$28:$G$38,6)+(E85-HLOOKUP(E85,'Variable priser'!$C$28:$G$38,1))*HLOOKUP(E85,'Variable priser'!$C$28:$G$38,7))/E85*'Variable priser'!$L$31*(1+Genanskaffelsespriser!$D$203),\"Fejl\"))","v":19304.369733599997},{"$f":"IF(F85=0,\"Variabel pris\",IFERROR((HLOOKUP(F85,'Variable priser'!$C$28:$G$38,6)+(F85-HLOOKUP(F85,'Variable priser'!$C$28:$G$38,1))*HLOOKUP(F85,'Variable priser'!$C$28:$G$38,7))/F85*'Variable priser'!$L$31*(1+Genanskaffelsespriser!$D$203),\"Fejl\"))","v":19304.369733599997},33975.69073113599,33975.69073113599,1,1]
["Filteranlæg, trykfiltre, enkelt filtrering","m³/h ",{"$f":"Genanskaffelsespriser!$E$46","v":25},0,0,0,0,0,null,{"$f":"IF(E86=0,\"Variabel pris\",IFERROR((HLOOKUP(E86,'Variable priser'!$C$40:$H$42,2)+(E86-HLOOKUP(E86,'Variable priser'!$C$40:$H$42,1))*HLOOKUP(E86,'Variable priser'!$C$40:$H$42,3))/E86*(1+Genanskaffelsespriser!$D$203),\"Fejl\"))","v":"Variabel pris"},{"$f":"IF(F86=0,\"Variabel pris\",IFERROR((HLOOKUP(F86,'Variable priser'!$C$40:$H$42,2)+(F86-HLOOKUP(F86,'Variable priser'!$C$40:$H$42,1))*HLOOKUP(F86,'Variable priser'!$C$40:$H$42,3))/F86*(1+Genanskaffelsespriser!$D$203),\"Fejl\"))","v":"Variabel pris"},"","",1,1]
["Filteranlæg, trykfiltre, dobbelt filtrering","m³/h ",{"$f":"Genanskaffelsespriser!$E$47","v":25},0,0,0,0,0,null,{"$f":"IF(E87=0,\"Variabel pris\",IFERROR((HLOOKUP(E87,'Variable priser'!$C$44:$H$46,2)+(E87-HLOOKUP(E87,'Variable priser'!$C$44:$H$46,1))*HLOOKUP(E87,'Variable priser'!$C$44:$H$46,3))/E87*(1+Genanskaffelsespriser!$D$203),\"Fejl\"))","v":"Variabel pris"},{"$f":"IF(F87=0,\"Variabel pris\",IFERROR((HLOOKUP(F87,'Variable priser'!$C$44:$H$46,2)+(F87-HLOOKUP(F87,'Variable priser'!$C$44:$H$46,1))*HLOOKUP(F87,'Variable priser'!$C$44:$H$46,3))/F87*(1+Genanskaffelsespriser!$D$203),\"Fejl\"))","v":"Variabel pris"},"","",1,1]
["Rentvandsbeholder  insitu støbt","m³",{"$f":"Genanskaffelsespriser!$E$48","v":50},135,135,135,0,0,null,{"$f":"IF(E88=0,\"Variabel pris\",IFERROR((HLOOKUP(E88,'Variable priser'!$C$48:$H$50,2)+(E88-HLOOKUP(E88,'Variable priser'!$C$48:$H$50,1))*HLOOKUP(E88,'Variable priser'!$C$48:$H$50,3))/E88*(1+Genanskaffelsespriser!$D$203),\"Fejl\"))","v":5225.2399784444442},{"$f":"IF(F88=0,\"Variabel pris\",IFERROR((HLOOKUP(F88,'Variable priser'!$C$48:$H$50,2)+(F88-HLOOKUP(F88,'Variable priser'!$C$48:$H$50,1))*HLOOKUP(F88,'Variable priser'!$C$48:$H$50,3))/F88*(1+Genanskaffelsespriser!$D$203),\"Fejl\"))","v":5225.2399784444442},14108.1479418,14108.1479418,1,1]
["Rentvandsbeholder  element","m³",{"$f":"Genanskaffelsespriser!$E$49","v":50},0,0,0,0,0,null,{"$f":"IF(E89=0,\"Variabel pris\",IFERROR((HLOOKUP(E89,'Variable priser'!$C$52:$H$54,2)+(E89-HLOOKUP(E89,'Variable priser'!$C$52:$H$54,1))*HLOOKUP(E89,'Variable priser'!$C$52:$H$54,3))/E89*(1+Genanskaffelsespriser!$D$203),\"Fejl\"))","v":"Variabel pris"},{"$f":"IF(F89=0,\"Variabel pris\",IFERROR((HLOOKUP(F89,'Variable priser'!$C$52:$H$54,2)+(F89-HLOOKUP(F89,'Variable priser'!$C$52:$H$54,1))*HLOOKUP(F89,'Variable priser'!$C$52:$H$54,3))/F89*(1+Genanskaffelsespriser!$D$203),\"Fejl\"))","v":"Variabel pris"},"","",1,1]
["Udpumpningsanlæg, rentvandspumper på vandværk","m³/h ",{"$f":"Genanskaffelsespriser!$E$50","v":25},150,150,150,0,0,null,{"$f":"IF(E90=0,\"Variabel pris\",IFERROR((HLOOKUP(E90,'Variable priser'!$C$71:$H$73,2)+(E90-HLOOKUP(E90,'Variable priser'!$C$71:$H$73,1))*HLOOKUP(E90,'Variable priser'!$C$71:$H$73,3))/E90*(1+Genanskaffelsespriser!$D$203),\"Fejl\"))","v":1324.499032222222},{"$f":"IF(F90=0,\"Variabel pris\",IFERROR((HLOOKUP(F90,'Variable priser'!$C$71:$H$73,2)+(F90-HLOOKUP(F90,'Variable priser'!$C$71:$H$73,1))*HLOOKUP(F90,'Variable priser'!$C$71:$H$73,3))/F90*(1+Genanskaffelsespriser!$D$203),\"Fejl\"))","v":1324.499032222222},7946.9941933333312,7946.9941933333312,1,1]
["Udpumpningsanlæg, frekvensomformer","kW",{"$f":"Genanskaffelsespriser!$E$51","v":25},10,10,10,0,0,null,{"$f":"IF(E91=0,\"Variabel pris\",IFERROR((HLOOKUP(E91,'Variable priser'!$C$76:$J$78,2)+(E91-HLOOKUP(E91,'Variable priser'!$C$76:$J$78,1))*HLOOKUP(E91,'Variable priser'!$C$76:$J$78,3))/E91*(1+Genanskaffelsespriser!$D$203),\"Fejl\"))","v":8813.326116000002},{"$f":"IF(F91=0,\"Variabel pris\",IFERROR((HLOOKUP(F91,'Variable priser'!$C$76:$J$78,2)+(F91-HLOOKUP(F91,'Variable priser'!$C$76:$J$78,1))*HLOOKUP(F91,'Variable priser'!$C$76:$J$78,3))/F91*(1+Genanskaffelsespriser!$D$203),\"Fejl\"))","v":8813.326116000002},3525.3304464000012,3525.3304464000012,1,1]
["Udpumpningsanlæg, Hydrofor","liter",{"$f":"Genanskaffelsespriser!$E$52","v":25},0,0,0,0,0,null,{"$f":"IF(E92=0,\"Variabel pris\",IFERROR((HLOOKUP(E92,'Variable priser'!$C$81:$J$83,2)+(E92-HLOOKUP(E92,'Variable priser'!$C$81:$J$83,1))*HLOOKUP(E92,'Variable priser'!$C$81:$J$83,3))/E92*(1+Genanskaffelsespriser!$D$203),\"Fejl\"))","v":"Variabel pris"},{"$f":"IF(F92=0,\"Variabel pris\",IFERROR((HLOOKUP(F92,'Variable priser'!$C$81:$J$83,2)+(F92-HLOOKUP(F92,'Variable priser'!$C$81:$J$83,1))*HLOOKUP(F92,'Variable priser'!$C$81:$J$83,3))/F92*(1+Genanskaffelsespriser!$D$203),\"Fejl\"))","v":"Variabel pris"},"","",1,1]
["Skyllevand-/slamhåndteringsanlæg - lukkede betonbeholdere","m³",{"$f":"Genanskaffelsespriser!$E$53","v":50},20,20,20,0,0,null,{"$f":"IF(E93=0,\"Variabel pris\",IFERROR((HLOOKUP(E93,'Variable priser'!$C$59:$H$61,2)+(E93-HLOOKUP(E93,'Variable priser'!$C$59:$H$61,1))*HLOOKUP(E93,'Variable priser'!$C$59:$H$61,3))/E93*(1+Genanskaffelsespriser!$D$203),\"Fejl\"))","v":5400.2480159999986},{"$f":"IF(F93=0,\"Variabel pris\",IFERROR((HLOOKUP(F93,'Variable priser'!$C$59:$H$61,2)+(F93-HLOOKUP(F93,'Variable priser'!$C$59:$H$61,1))*HLOOKUP(F93,'Variable priser'!$C$59:$H$61,3))/F93*(1+Genanskaffelsespriser!$D$203),\"Fejl\"))","v":5400.2480159999986},2160.0992063999993,2160.0992063999993,1,1]
["Skyllevand-/slamhåndteringsanl. - åbne med faste sider/bund","m³",{"$f":"Genanskaffelsespriser!$E$54","v":50},0,0,0,0,0,null,{"$f":"IF(E94=0,\"Variabel pris\",IFERROR((HLOOKUP(E94,'Variable priser'!$C$59:$H$64,5)+(E94-HLOOKUP(E94,'Variable priser'!$C$59:$H$64,1))*HLOOKUP(E94,'Variable priser'!$C$59:$H$64,6))/E94*(1+Genanskaffelsespriser!$D$203),\"Fejl\"))","v":"Variabel pris"},{"$f":"IF(F94=0,\"Variabel pris\",IFERROR((HLOOKUP(F94,'Variable priser'!$C$59:$H$64,5)+(F94-HLOOKUP(F94,'Variable priser'!$C$59:$H$64,1))*HLOOKUP(F94,'Variable priser'!$C$59:$H$64,6))/F94*(1+Genanskaffelsespriser!$D$203),\"Fejl\"))","v":"Variabel pris"},"","",1,1]
["Skyllevand-/slamhåndteringsanlæg - jordbassiner","m³",{"$f":"Genanskaffelsespriser!$E$55","v":50},0,0,0,0,0,null,{"$f":"IF(E95=0,\"Variabel pris\",IFERROR((HLOOKUP(E95,'Variable priser'!$C$59:$H$67,8)+(E95-HLOOKUP(E95,'Variable priser'!$C$59:$H$67,1))*HLOOKUP(E95,'Variable priser'!$C$59:$H$67,9))/E95*(1+Genanskaffelsespriser!$D$203),\"Fejl\"))","v":"Variabel pris"},{"$f":"IF(F95=0,\"Variabel pris\",IFERROR((HLOOKUP(F95,'Variable priser'!$C$59:$H$67,8)+(F95-HLOOKUP(F95,'Variable priser'!$C$59:$H$67,1))*HLOOKUP(F95,'Variable priser'!$C$59:$H$67,9))/F95*(1+Genanskaffelsespriser!$D$203),\"Fejl\"))","v":"Variabel pris"},"","",1,1]
["Skyllevandsbehandling, inkl. UV-filter mv., Mek./EL","m³/h.",{"$f":"Genanskaffelsespriser!$E$56","v":25},3,3,3,0,0,null,{"$f":"IF(E96=0,\"Variabel pris\",IFERROR((HLOOKUP(E96,'Variable priser'!$C$108:$E$110,2)+(E96-HLOOKUP(E96,'Variable priser'!$C$108:$E$110,1))*HLOOKUP(E96,'Variable priser'!$C$108:$E$110,3))/E96*'Variable priser'!$H$109*(1+Genanskaffelsespriser!$D$203),\"Fejl\"))","v":22725.411682499995},{"$f":"IF(F96=0,\"Variabel pris\",IFERROR((HLOOKUP(F96,'Variable priser'!$C$108:$E$110,2)+(F96-HLOOKUP(F96,'Variable priser'!$C$108:$E$110,1))*HLOOKUP(F96,'Variable priser'!$C$108:$E$110,3))/F96*'Variable priser'!$H$109*(1+Genanskaffelsespriser!$D$203),\"Fejl\"))","v":22725.411682499995},2727.0494018999993,2727.0494018999993,1,1]
["Skyllevandsbehandling, inkl. UV-filter mv., SRO","m³/h.",{"$f":"Genanskaffelsespriser!$E$57","v":10},3,3,3,0,0,null,{"$f":"IF(E97=0,\"Variabel pris\",IFERROR((HLOOKUP(E97,'Variable priser'!$C$108:$E$110,2)+(E97-HLOOKUP(E97,'Variable priser'!$C$108:$E$110,1))*HLOOKUP(E97,'Variable priser'!$C$108:$E$110,3))/E97*'Variable priser'!$I$109*(1+Genanskaffelsespriser!$D$203),\"Fejl\"))","v":4010.3667674999988},{"$f":"IF(F97=0,\"Variabel pris\",IFERROR((HLOOKUP(F97,'Variable priser'!$C$108:$E$110,2)+(F97-HLOOKUP(F97,'Variable priser'!$C$108:$E$110,1))*HLOOKUP(F97,'Variable priser'!$C$108:$E$110,3))/F97*'Variable priser'!$I$109*(1+Genanskaffelsespriser!$D$203),\"Fejl\"))","v":4010.3667674999988},1203.1100302499995,1203.1100302499995,1,1]
["Nødstrømsanlæg på vandværk","kW",{"$f":"Genanskaffelsespriser!$E$58","v":25},0,0,0,0,0,null,{"$f":"IF(E98=0,\"Variabel pris\",IFERROR((HLOOKUP(E98,'Variable priser'!$C$86:$H$88,2)+(E98-HLOOKUP(E98,'Variable priser'!$C$86:$H$88,1))*HLOOKUP(E98,'Variable priser'!$C$86:$H$88,3))/E98*(1+Genanskaffelsespriser!$D$203),\"Fejl\"))","v":"Variabel pris"},{"$f":"IF(F98=0,\"Variabel pris\",IFERROR((HLOOKUP(F98,'Variable priser'!$C$86:$H$88,2)+(F98-HLOOKUP(F98,'Variable priser'!$C$86:$H$88,1))*HLOOKUP(F98,'Variable priser'!$C$86:$H$88,3))/F98*(1+Genanskaffelsespriser!$D$203),\"Fejl\"))","v":"Variabel pris"},"","",1,1]
["Elanlæg og SRO-anlæg - vandværk, Elanlæg","m³/h.",{"$f":"Genanskaffelsespriser!$E$59","v":25},44,44,44,0,0,null,{"$f":"IF(E99=0,\"Variabel pris\",IFERROR((HLOOKUP(E99,'Variable priser'!$C$91:$J$95,4)+(E99-HLOOKUP(E99,'Variable priser'!$C$91:$J$95,1))*HLOOKUP(E99,'Variable priser'!$C$91:$J$95,5))/E99*(1+Genanskaffelsespriser!$D$203),\"Fejl\"))","v":7888.0027199999995},{"$f":"IF(F99=0,\"Variabel pris\",IFERROR((HLOOKUP(F99,'Variable priser'!$C$91:$J$95,4)+(F99-HLOOKUP(F99,'Variable priser'!$C$91:$J$95,1))*HLOOKUP(F99,'Variable priser'!$C$91:$J$95,5))/F99*(1+Genanskaffelsespriser!$D$203),\"Fejl\"))","v":7888.0027199999995},13882.884787200001,13882.884787200001,1,1]
["Elanlæg og SRO-anlæg - vandværk, SRO","m³/h.",{"$f":"Genanskaffelsespriser!$E$60","v":10},44,44,44,0,0,null,{"$f":"IF(E100=0,\"Variabel pris\",IFERROR((HLOOKUP(E100,'Variable priser'!$C$91:$J$98,7)+(E100-HLOOKUP(E100,'Variable priser'!$C$91:$J$98,1))*HLOOKUP(E100,'Variable priser'!$C$91:$J$98,8))/E100*(1+Genanskaffelsespriser!$D$203),\"Fejl\"))","v":6067.6943999999994},{"$f":"IF(F100=0,\"Variabel pris\",IFERROR((HLOOKUP(F100,'Variable priser'!$C$91:$J$98,7)+(F100-HLOOKUP(F100,'Variable priser'!$C$91:$J$98,1))*HLOOKUP(F100,'Variable priser'!$C$91:$J$98,8))/F100*(1+Genanskaffelsespriser!$D$203),\"Fejl\"))","v":6067.6943999999994},26697.855359999998,26697.855359999998,1,1]
["Vandværk 3"]
["Beluftningsanlæg, iltningstrappe, Konstruktioner","m³/h ",{"$f":"Genanskaffelsespriser!$E$30","v":50},0,null,null,0,"",null,{"$f":"IF(E102=0,\"Variabel pris\",IFERROR((HLOOKUP(E102,'Variable priser'!$C$6:$H$16,2)+(E102-HLOOKUP(E102,'Variable priser'!$C$6:$H$16,1))*HLOOKUP(E102,'Variable priser'!$C$6:$H$16,3))/E102*'Variable priser'!$K$7*(1+Genanskaffelsespriser!$D$203),\"Fejl\"))","v":"Variabel pris"},{"$f":"IF(F102=0,\"Variabel pris\",IFERROR((HLOOKUP(F102,'Variable priser'!$C$6:$H$16,2)+(F102-HLOOKUP(F102,'Variable priser'!$C$6:$H$16,1))*HLOOKUP(F102,'Variable priser'!$C$6:$H$16,3))/F102*'Variable priser'!$K$7*(1+Genanskaffelsespriser!$D$203),\"Fejl\"))","v":"Variabel pris"},{"$f":"IF(ISBLANK(E102),\"\",IF(E102=0,\"\",IF(ISNUMBER(E102),((J102*E102)/C102)*N102,\"\")))","v":""},{"$f":"IF(ISBLANK(F102),\"\",IF(F102=0,\"\",IF(ISNUMBER(F102),((K102*F102)/C102)*N102,\"\")))","v":""},1,1]
["Beluftningsanlæg, iltningstrappe, Mek./EL","m³/h ",{"$f":"Genanskaffelsespriser!$E$31","v":25},0,null,null,0,"",null,{"$f":"IF(E103=0,\"Variabel pris\",IFERROR((HLOOKUP(E103,'Variable priser'!$C$6:$H$16,2)+(E103-HLOOKUP(E103,'Variable priser'!$C$6:$H$16,1))*HLOOKUP(E103,'Variable priser'!$C$6:$H$16,3))/E103*'Variable priser'!$L$7*(1+Genanskaffelsespriser!$D$203),\"Fejl\"))","v":"Variabel pris"},{"$f":"IF(F103=0,\"Variabel pris\",IFERROR((HLOOKUP(F103,'Variable priser'!$C$6:$H$16,2)+(F103-HLOOKUP(F103,'Variable priser'!$C$6:$H$16,1))*HLOOKUP(F103,'Variable priser'!$C$6:$H$16,3))/F103*'Variable priser'!$L$7*(1+Genanskaffelsespriser!$D$203),\"Fejl\"))","v":"Variabel pris"},{"$f":"IF(ISBLANK(E103),\"\",IF(E103=0,\"\",IF(ISNUMBER(E103),((J103*E103)/C103)*N103,\"\")))","v":""},{"$f":"IF(ISBLANK(F103),\"\",IF(F103=0,\"\",IF(ISNUMBER(F103),((K103*F103)/C103)*N103,\"\")))","v":""},1,1]
["Beluftningsanlæg, ika-beluftning, Konstruktioner","m³/h ",{"$f":"Genanskaffelsespriser!$E$32","v":50},0,null,null,0,"",null,{"$f":"IF(E104=0,\"Variabel pris\",IFERROR((HLOOKUP(E104,'Variable priser'!$C$6:$H$16,4)+(E104-HLOOKUP(E104,'Variable priser'!$C$6:$H$16,1))*HLOOKUP(E104,'Variable priser'!$C$6:$H$16,5))/E104*'Variable priser'!$K$9*(1+Genanskaffelsespriser!$D$203),\"Fejl\"))","v":"Variabel pris"},{"$f":"IF(F104=0,\"Variabel pris\",IFERROR((HLOOKUP(F104,'Variable priser'!$C$6:$H$16,4)+(F104-HLOOKUP(F104,'Variable priser'!$C$6:$H$16,1))*HLOOKUP(F104,'Variable priser'!$C$6:$H$16,5))/F104*'Variable priser'!$K$9*(1+Genanskaffelsespriser!$D$203),\"Fejl\"))","v":"Variabel pris"},"","",1,1]
["Beluftningsanlæg, ika-beluftning, Mek./EL","m³/h ",{"$f":"Genanskaffelsespriser!$E$33","v":25},0,null,null,0,"",null,{"$f":"IF(E105=0,\"Variabel pris\",IFERROR((HLOOKUP(E105,'Variable priser'!$C$6:$H$16,4)+(E105-HLOOKUP(E105,'Variable priser'!$C$6:$H$16,1))*HLOOKUP(E105,'Variable priser'!$C$6:$H$16,5))/E105*'Variable priser'!$L$9*(1+Genanskaffelsespriser!$D$203),\"Fejl\"))","v":"Variabel pris"},{"$f":"IF(F105=0,\"Variabel pris\",IFERROR((HLOOKUP(F105,'Variable priser'!$C$6:$H$16,4)+(F105-HLOOKUP(F105,'Variable priser'!$C$6:$H$16,1))*HLOOKUP(F105,'Variable priser'!$C$6:$H$16,5))/F105*'Variable priser'!$L$9*(1+Genanskaffelsespriser!$D$203),\"Fejl\"))","v":"Variabel pris"},"","",1,1]
["Beluftningsanlæg, bundbeluftbning, Konstruktioner","m³/h ",{"$f":"Genanskaffelsespriser!$E$34","v":50},0,null,null,0,"",null,{"$f":"IF(E106=0,\"Variabel pris\",IFERROR((HLOOKUP(E106,'Variable priser'!$C$6:$H$16,6)+(E106-HLOOKUP(E106,'Variable priser'!$C$6:$H$16,1))*HLOOKUP(E106,'Variable priser'!$C$6:$H$16,7))/E106*'Variable priser'!$K$17*(1+Genanskaffelsespriser!$D$203),\"Fejl\"))","v":"Variabel pris"},{"$f":"IF(F106=0,\"Variabel pris\",IFERROR((HLOOKUP(F106,'Variable priser'!$C$6:$H$16,6)+(F106-HLOOKUP(F106,'Variable priser'!$C$6:$H$16,1))*HLOOKUP(F106,'Variable priser'!$C$6:$H$16,7))/F106*'Variable priser'!$K$17*(1+Genanskaffelsespriser!$D$203),\"Fejl\"))","v":"Variabel pris"},"","",1,1]
["Beluftningsanlæg, bundbeluftbning, Mek./EL","m³/h ",{"$f":"Genanskaffelsespriser!$E$35","v":25},0,null,null,0,"",null,{"$f":"IF(E107=0,\"Variabel pris\",IFERROR((HLOOKUP(E107,'Variable priser'!$C$6:$H$16,6)+(E107-HLOOKUP(E107,'Variable priser'!$C$6:$H$16,1))*HLOOKUP(E107,'Variable priser'!$C$6:$H$16,7))/E107*'Variable priser'!$L$17*(1+Genanskaffelsespriser!$D$203),\"Fejl\"))","v":"Variabel pris"},{"$f":"IF(F107=0,\"Variabel pris\",IFERROR((HLOOKUP(F107,'Variable priser'!$C$6:$H$16,6)+(F107-HLOOKUP(F107,'Variable priser'!$C$6:$H$16,1))*HLOOKUP(F107,'Variable priser'!$C$6:$H$16,7))/F107*'Variable priser'!$L$17*(1+Genanskaffelsespriser!$D$203),\"Fejl\"))","v":"Variabel pris"},"","",1,1]
["Beluftningsanlæg, rislebakke, Konstruktioner","m³/h ",{"$f":"Genanskaffelsespriser!$E$36","v":50},0,null,null,0,"",null,{"$f":"IF(E108=0,\"Variabel pris\",IFERROR((HLOOKUP(E108,'Variable priser'!$C$6:$H$18,12)+(E108-HLOOKUP(E108,'Variable priser'!$C$6:$H$18,1))*HLOOKUP(E108,'Variable priser'!$C$6:$H$18,13))/E108*'Variable priser'!$K$17*(1+Genanskaffelsespriser!$D$203),\"Fejl\"))","v":"Variabel pris"},{"$f":"IF(F108=0,\"Variabel pris\",IFERROR((HLOOKUP(F108,'Variable priser'!$C$6:$H$18,12)+(F108-HLOOKUP(F108,'Variable priser'!$C$6:$H$18,1))*HLOOKUP(F108,'Variable priser'!$C$6:$H$18,13))/F108*'Variable priser'!$K$17*(1+Genanskaffelsespriser!$D$203),\"Fejl\"))","v":"Variabel pris"},"","",1,1]
["Beluftningsanlæg, rislebakke, Mek./EL","m³/h ",{"$f":"Genanskaffelsespriser!$E$37","v":25},0,null,null,0,"",null,{"$f":"IF(E109=0,\"Variabel pris\",IFERROR((HLOOKUP(E109,'Variable priser'!$C$6:$H$18,12)+(E109-HLOOKUP(E109,'Variable priser'!$C$6:$H$18,1))*HLOOKUP(E109,'Variable priser'!$C$6:$H$18,13))/E109*'Variable priser'!$L$17*(1+Genanskaffelsespriser!$D$203),\"Fejl\"))","v":"Variabel pris"},{"$f":"IF(F109=0,\"Variabel pris\",IFERROR((HLOOKUP(F109,'Variable priser'!$C$6:$H$18,12)+(F109-HLOOKUP(F109,'Variable priser'!$C$6:$H$18,1))*HLOOKUP(F109,'Variable priser'!$C$6:$H$18,13))/F109*'Variable priser'!$L$17*(1+Genanskaffelsespriser!$D$203),\"Fejl\"))","v":"Variabel pris"},"","",1,1]
["Beluftningsanlæg, kompressorbeluftning","m³/h ",{"$f":"Genanskaffelsespriser!$E$38","v":25},0,null,null,0,"",null,{"$f":"IF(E110=0,\"Variabel pris\",IFERROR((HLOOKUP(E110,'Variable priser'!$C$6:$H$16,8)+(E110-HLOOKUP(E110,'Variable priser'!$C$6:$H$16,1))*HLOOKUP(E110,'Variable priser'!$C$6:$H$16,9))/E110*(1+Genanskaffelsespriser!$D$203),\"Fejl\"))","v":"Variabel pris"},{"$f":"IF(F110=0,\"Variabel pris\",IFERROR((HLOOKUP(F110,'Variable priser'!$C$6:$H$16,8)+(F110-HLOOKUP(F110,'Variable priser'!$C$6:$H$16,1))*HLOOKUP(F110,'Variable priser'!$C$6:$H$16,9))/F110*(1+Genanskaffelsespriser!$D$203),\"Fejl\"))","v":"Variabel pris"},"","",1,1]
["Beluftningsanlæg, ren ilt","m³/h ",{"$f":"Genanskaffelsespriser!$E$39","v":25},0,null,null,0,"",null,{"$f":"IF(E111=0,\"Variabel pris\",IFERROR((HLOOKUP(E111,'Variable priser'!$C$6:$H$16,10)+(E111-HLOOKUP(E111,'Variable priser'!$C$6:$H$16,1))*HLOOKUP(E111,'Variable priser'!$C$6:$H$16,11))/E111*(1+Genanskaffelsespriser!$D$203),\"Fejl\"))","v":"Variabel pris"},{"$f":"IF(F111=0,\"Variabel pris\",IFERROR((HLOOKUP(F111,'Variable priser'!$C$6:$H$16,10)+(F111-HLOOKUP(F111,'Variable priser'!$C$6:$H$16,1))*HLOOKUP(F111,'Variable priser'!$C$6:$H$16,11))/F111*(1+Genanskaffelsespriser!$D$203),\"Fejl\"))","v":"Variabel pris"},"","",1,1]
["Behandlingsanlæg, kalk anlæg","m³/h ",{"$f":"Genanskaffelsespriser!$E$40","v":25},0,null,null,0,"",null,{"$f":"IF(E112=0,\"Variabel pris\",IFERROR((HLOOKUP(E112,'Variable priser'!$C$20:$G$24,3)+(E112-HLOOKUP(E112,'Variable priser'!$C$20:$G$24,1))*HLOOKUP(E112,'Variable priser'!$C$20:$G$24,4))/E112*(1+Genanskaffelsespriser!$D$203),\"Fejl\"))","v":"Variabel pris"},{"$f":"IF(F112=0,\"Variabel pris\",IFERROR((HLOOKUP(F112,'Variable priser'!$C$20:$G$24,3)+(F112-HLOOKUP(F112,'Variable priser'!$C$20:$G$24,1))*HLOOKUP(F112,'Variable priser'!$C$20:$G$24,4))/F112*(1+Genanskaffelsespriser!$D$203),\"Fejl\"))","v":"Variabel pris"},"","",1,1]
["Behandlingsanlæg, luddosering","m³/h ",{"$f":"Genanskaffelsespriser!$E$41","v":25},0,null,null,0,"",null,{"$f":"IF(E113=0,\"Variabel pris\",IFERROR((HLOOKUP(E113,'Variable priser'!$C$20:$G$25,5)+(E113-HLOOKUP(E113,'Variable priser'!$C$20:$G$25,1))*HLOOKUP(E113,'Variable priser'!$C$20:$G$25,6))/E113*(1+Genanskaffelsespriser!$D$203),\"Fejl\"))","v":"Variabel pris"},{"$f":"IF(F113=0,\"Variabel pris\",IFERROR((HLOOKUP(F113,'Variable priser'!$C$20:$G$25,5)+(F113-HLOOKUP(F113,'Variable priser'!$C$20:$G$25,1))*HLOOKUP(F113,'Variable priser'!$C$20:$G$25,6))/F113*(1+Genanskaffelsespriser!$D$203),\"Fejl\"))","v":"Variabel pris"},"","",1,1]
["Filteranlæg, åbne filtre, enkelt filtrering, Konstruktioner","m³/h ",{"$f":"Genanskaffelsespriser!$E$42","v":50},0,null,null,0,"",null,{"$f":"IF(E114=0,\"Variabel pris\",IFERROR((HLOOKUP(E114,'Variable priser'!$C$28:$G$38,9)+(E114-HLOOKUP(E114,'Variable priser'!$C$28:$G$38,1))*HLOOKUP(E114,'Variable priser'!$C$28:$G$38,10))/E114*'Variable priser'!$K$31*(1+Genanskaffelsespriser!$D$203),\"Fejl\"))","v":"Variabel pris"},{"$f":"IF(F114=0,\"Variabel pris\",IFERROR((HLOOKUP(F114,'Variable priser'!$C$28:$G$38,9)+(F114-HLOOKUP(F114,'Variable priser'!$C$28:$G$38,1))*HLOOKUP(F114,'Variable priser'!$C$28:$G$38,10))/F114*'Variable priser'!$K$31*(1+Genanskaffelsespriser!$D$203),\"Fejl\"))","v":"Variabel pris"},"","",1,1]
["Filteranlæg, åbne filtre, enkelt filtrering, Mek./EL","m³/h ",{"$f":"Genanskaffelsespriser!$E$43","v":25},0,null,null,0,"",null,{"$f":"IF(E115=0,\"Variabel pris\",IFERROR((HLOOKUP(E115,'Variable priser'!$C$28:$G$38,9)+(E115-HLOOKUP(E115,'Variable priser'!$C$28:$G$38,1))*HLOOKUP(E115,'Variable priser'!$C$28:$G$38,10))/E115*'Variable priser'!$L$31*(1+Genanskaffelsespriser!$D$203),\"Fejl\"))","v":"Variabel pris"},{"$f":"IF(F115=0,\"Variabel pris\",IFERROR((HLOOKUP(F115,'Variable priser'!$C$28:$G$38,9)+(F115-HLOOKUP(F115,'Variable priser'!$C$28:$G$38,1))*HLOOKUP(F115,'Variable priser'!$C$28:$G$38,10))/F115*'Variable priser'!$L$31*(1+Genanskaffelsespriser!$D$203),\"Fejl\"))","v":"Variabel pris"},"","",1,1]
["Filteranlæg, åbne filtre, dobbelt filtrering, Konstruktioner","m³/h ",{"$f":"Genanskaffelsespriser!$E$44","v":50},0,null,null,0,"",null,{"$f":"IF(E116=0,\"Variabel pris\",IFERROR((HLOOKUP(E116,'Variable priser'!$C$28:$G$38,6)+(E116-HLOOKUP(E116,'Variable priser'!$C$28:$G$38,1))*HLOOKUP(E116,'Variable priser'!$C$28:$G$38,7))/E116*'Variable priser'!$K$31*(1+Genanskaffelsespriser!$D$203),\"Fejl\"))","v":"Variabel pris"},{"$f":"IF(F116=0,\"Variabel pris\",IFERROR((HLOOKUP(F116,'Variable priser'!$C$28:$G$38,6)+(F116-HLOOKUP(F116,'Variable priser'!$C$28:$G$38,1))*HLOOKUP(F116,'Variable priser'!$C$28:$G$38,7))/F116*'Variable priser'!$K$31*(1+Genanskaffelsespriser!$D$203),\"Fejl\"))","v":"Variabel pris"},"","",1,1]
["Filteranlæg, åbne filtre, dobbelt filtrering, Mek./EL","m³/h ",{"$f":"Genanskaffelsespriser!$E$45","v":25},0,null,null,0,"",null,{"$f":"IF(E117=0,\"Variabel pris\",IFERROR((HLOOKUP(E117,'Variable priser'!$C$28:$G$38,6)+(E117-HLOOKUP(E117,'Variable priser'!$C$28:$G$38,1))*HLOOKUP(E117,'Variable priser'!$C$28:$G$38,7))/E117*'Variable priser'!$L$31*(1+Genanskaffelsespriser!$D$203),\"Fejl\"))","v":"Variabel pris"},{"$f":"IF(F117=0,\"Variabel pris\",IFERROR((HLOOKUP(F117,'Variable priser'!$C$28:$G$38,6)+(F117-HLOOKUP(F117,'Variable priser'!$C$28:$G$38,1))*HLOOKUP(F117,'Variable priser'!$C$28:$G$38,7))/F117*'Variable priser'!$L$31*(1+Genanskaffelsespriser!$D$203),\"Fejl\"))","v":"Variabel pris"},"","",1,1]
["Filteranlæg, trykfiltre, enkelt filtrering","m³/h ",{"$f":"Genanskaffelsespriser!$E$46","v":25},0,null,null,0,"",null,{"$f":"IF(E118=0,\"Variabel pris\",IFERROR((HLOOKUP(E118,'Variable priser'!$C$40:$H$42,2)+(E118-HLOOKUP(E118,'Variable priser'!$C$40:$H$42,1))*HLOOKUP(E118,'Variable priser'!$C$40:$H$42,3))/E118*(1+Genanskaffelsespriser!$D$203),\"Fejl\"))","v":"Variabel pris"},{"$f":"IF(F118=0,\"Variabel pris\",IFERROR((HLOOKUP(F118,'Variable priser'!$C$40:$H$42,2)+(F118-HLOOKUP(F118,'Variable priser'!$C$40:$H$42,1))*HLOOKUP(F118,'Variable priser'!$C$40:$H$42,3))/F118*(1+Genanskaffelsespriser!$D$203),\"Fejl\"))","v":"Variabel pris"},"","",1,1]
["Filteranlæg, trykfiltre, dobbelt filtrering","m³/h ",{"$f":"Genanskaffelsespriser!$E$47","v":25},0,null,null,0,"",null,{"$f":"IF(E119=0,\"Variabel pris\",IFERROR((HLOOKUP(E119,'Variable priser'!$C$44:$H$46,2)+(E119-HLOOKUP(E119,'Variable priser'!$C$44:$H$46,1))*HLOOKUP(E119,'Variable priser'!$C$44:$H$46,3))/E119*(1+Genanskaffelsespriser!$D$203),\"Fejl\"))","v":"Variabel pris"},{"$f":"IF(F119=0,\"Variabel pris\",IFERROR((HLOOKUP(F119,'Variable priser'!$C$44:$H$46,2)+(F119-HLOOKUP(F119,'Variable priser'!$C$44:$H$46,1))*HLOOKUP(F119,'Variable priser'!$C$44:$H$46,3))/F119*(1+Genanskaffelsespriser!$D$203),\"Fejl\"))","v":"Variabel pris"},"","",1,1]
["Rentvandsbeholder  insitu støbt","m³",{"$f":"Genanskaffelsespriser!$E$48","v":50},0,null,null,{"$f":"IF($D120=\"\",IF($E120>0,\"Ny data\",IF($E120=\"\",\"\",0)),IF($D120=0,IF($E120=0,0,\"Ny data\"),($E120-$D120)/$D120))","v":0},"",null,{"$f":"IF(E120=0,\"Variabel pris\",IFERROR((HLOOKUP(E120,'Variable priser'!$C$48:$H$50,2)+(E120-HLOOKUP(E120,'Variable priser'!$C$48:$H$50,1))*HLOOKUP(E120,'Variable priser'!$C$48:$H$50,3))/E120*(1+Genanskaffelsespriser!$D$203),\"Fejl\"))","v":"Variabel pris"},{"$f":"IF(F120=0,\"Variabel pris\",IFERROR((HLOOKUP(F120,'Variable priser'!$C$48:$H$50,2)+(F120-HLOOKUP(F120,'Variable priser'!$C$48:$H$50,1))*HLOOKUP(F120,'Variable priser'!$C$48:$H$50,3))/F120*(1+Genanskaffelsespriser!$D$203),\"Fejl\"))","v":"Variabel pris"},"","",1,1]
["Rentvandsbeholder  element","m³",{"$f":"Genanskaffelsespriser!$E$49","v":50},0,null,null,0,"",null,{"$f":"IF(E121=0,\"Variabel pris\",IFERROR((HLOOKUP(E121,'Variable priser'!$C$52:$H$54,2)+(E121-HLOOKUP(E121,'Variable priser'!$C$52:$H$54,1))*HLOOKUP(E121,'Variable priser'!$C$52:$H$54,3))/E121*(1+Genanskaffelsespriser!$D$203),\"Fejl\"))","v":"Variabel pris"},{"$f":"IF(F121=0,\"Variabel pris\",IFERROR((HLOOKUP(F121,'Variable priser'!$C$52:$H$54,2)+(F121-HLOOKUP(F121,'Variable priser'!$C$52:$H$54,1))*HLOOKUP(F121,'Variable priser'!$C$52:$H$54,3))/F121*(1+Genanskaffelsespriser!$D$203),\"Fejl\"))","v":"Variabel pris"},"","",1,1]
["Udpumpningsanlæg, rentvandspumper på vandværk","m³/h ",{"$f":"Genanskaffelsespriser!$E$50","v":25},0,null,null,0,"",null,{"$f":"IF(E122=0,\"Variabel pris\",IFERROR((HLOOKUP(E122,'Variable priser'!$C$71:$H$73,2)+(E122-HLOOKUP(E122,'Variable priser'!$C$71:$H$73,1))*HLOOKUP(E122,'Variable priser'!$C$71:$H$73,3))/E122*(1+Genanskaffelsespriser!$D$203),\"Fejl\"))","v":"Variabel pris"},{"$f":"IF(F122=0,\"Variabel pris\",IFERROR((HLOOKUP(F122,'Variable priser'!$C$71:$H$73,2)+(F122-HLOOKUP(F122,'Variable priser'!$C$71:$H$73,1))*HLOOKUP(F122,'Variable priser'!$C$71:$H$73,3))/F122*(1+Genanskaffelsespriser!$D$203),\"Fejl\"))","v":"Variabel pris"},"","",1,1]
["Udpumpningsanlæg, frekvensomformer","kW",{"$f":"Genanskaffelsespriser!$E$51","v":25},0,null,null,0,"",null,{"$f":"IF(E123=0,\"Variabel pris\",IFERROR((HLOOKUP(E123,'Variable priser'!$C$76:$J$78,2)+(E123-HLOOKUP(E123,'Variable priser'!$C$76:$J$78,1))*HLOOKUP(E123,'Variable priser'!$C$76:$J$78,3))/E123*(1+Genanskaffelsespriser!$D$203),\"Fejl\"))","v":"Variabel pris"},{"$f":"IF(F123=0,\"Variabel pris\",IFERROR((HLOOKUP(F123,'Variable priser'!$C$76:$J$78,2)+(F123-HLOOKUP(F123,'Variable priser'!$C$76:$J$78,1))*HLOOKUP(F123,'Variable priser'!$C$76:$J$78,3))/F123*(1+Genanskaffelsespriser!$D$203),\"Fejl\"))","v":"Variabel pris"},"","",1,1]
["Udpumpningsanlæg, Hydrofor","liter",{"$f":"Genanskaffelsespriser!$E$52","v":25},0,null,null,0,"",null,{"$f":"IF(E124=0,\"Variabel pris\",IFERROR((HLOOKUP(E124,'Variable priser'!$C$81:$J$83,2)+(E124-HLOOKUP(E124,'Variable priser'!$C$81:$J$83,1))*HLOOKUP(E124,'Variable priser'!$C$81:$J$83,3))/E124*(1+Genanskaffelsespriser!$D$203),\"Fejl\"))","v":"Variabel pris"},{"$f":"IF(F124=0,\"Variabel pris\",IFERROR((HLOOKUP(F124,'Variable priser'!$C$81:$J$83,2)+(F124-HLOOKUP(F124,'Variable priser'!$C$81:$J$83,1))*HLOOKUP(F124,'Variable priser'!$C$81:$J$83,3))/F124*(1+Genanskaffelsespriser!$D$203),\"Fejl\"))","v":"Variabel pris"},"","",1,1]
["Skyllevand-/slamhåndteringsanlæg - lukkede betonbeholdere","m³",{"$f":"Genanskaffelsespriser!$E$53","v":50},0,null,null,0,"",null,{"$f":"IF(E125=0,\"Variabel pris\",IFERROR((HLOOKUP(E125,'Variable priser'!$C$59:$H$61,2)+(E125-HLOOKUP(E125,'Variable priser'!$C$59:$H$61,1))*HLOOKUP(E125,'Variable priser'!$C$59:$H$61,3))/E125*(1+Genanskaffelsespriser!$D$203),\"Fejl\"))","v":"Variabel pris"},{"$f":"IF(F125=0,\"Variabel pris\",IFERROR((HLOOKUP(F125,'Variable priser'!$C$59:$H$61,2)+(F125-HLOOKUP(F125,'Variable priser'!$C$59:$H$61,1))*HLOOKUP(F125,'Variable priser'!$C$59:$H$61,3))/F125*(1+Genanskaffelsespriser!$D$203),\"Fejl\"))","v":"Variabel pris"},"","",1,1]
["Skyllevand-/slamhåndteringsanl. - åbne med faste sider/bund","m³",{"$f":"Genanskaffelsespriser!$E$54","v":50},0,null,null,0,"",null,{"$f":"IF(E126=0,\"Variabel pris\",IFERROR((HLOOKUP(E126,'Variable priser'!$C$59:$H$64,5)+(E126-HLOOKUP(E126,'Variable priser'!$C$59:$H$64,1))*HLOOKUP(E126,'Variable priser'!$C$59:$H$64,6))/E126*(1+Genanskaffelsespriser!$D$203),\"Fejl\"))","v":"Variabel pris"},{"$f":"IF(F126=0,\"Variabel pris\",IFERROR((HLOOKUP(F126,'Variable priser'!$C$59:$H$64,5)+(F126-HLOOKUP(F126,'Variable priser'!$C$59:$H$64,1))*HLOOKUP(F126,'Variable priser'!$C$59:$H$64,6))/F126*(1+Genanskaffelsespriser!$D$203),\"Fejl\"))","v":"Variabel pris"},"","",1,1]
["Skyllevand-/slamhåndteringsanlæg - jordbassiner","m³",{"$f":"Genanskaffelsespriser!$E$55","v":50},0,null,null,0,"",null,{"$f":"IF(E127=0,\"Variabel pris\",IFERROR((HLOOKUP(E127,'Variable priser'!$C$59:$H$67,8)+(E127-HLOOKUP(E127,'Variable priser'!$C$59:$H$67,1))*HLOOKUP(E127,'Variable priser'!$C$59:$H$67,9))/E127*(1+Genanskaffelsespriser!$D$203),\"Fejl\"))","v":"Variabel pris"},{"$f":"IF(F127=0,\"Variabel pris\",IFERROR((HLOOKUP(F127,'Variable priser'!$C$59:$H$67,8)+(F127-HLOOKUP(F127,'Variable priser'!$C$59:$H$67,1))*HLOOKUP(F127,'Variable priser'!$C$59:$H$67,9))/F127*(1+Genanskaffelsespriser!$D$203),\"Fejl\"))","v":"Variabel pris"},"","",1,1]
["Skyllevandsbehandling, inkl. UV-filter mv., Mek./EL","m³/h.",{"$f":"Genanskaffelsespriser!$E$56","v":25},0,null,null,0,"",null,{"$f":"IF(E128=0,\"Variabel pris\",IFERROR((HLOOKUP(E128,'Variable priser'!$C$108:$E$110,2)+(E128-HLOOKUP(E128,'Variable priser'!$C$108:$E$110,1))*HLOOKUP(E128,'Variable priser'!$C$108:$E$110,3))/E128*'Variable priser'!$H$109*(1+Genanskaffelsespriser!$D$203),\"Fejl\"))","v":"Variabel pris"},{"$f":"IF(F128=0,\"Variabel pris\",IFERROR((HLOOKUP(F128,'Variable priser'!$C$108:$E$110,2)+(F128-HLOOKUP(F128,'Variable priser'!$C$108:$E$110,1))*HLOOKUP(F128,'Variable priser'!$C$108:$E$110,3))/F128*'Variable priser'!$H$109*(1+Genanskaffelsespriser!$D$203),\"Fejl\"))","v":"Variabel pris"},"","",1,1]
["Skyllevandsbehandling, inkl. UV-filter mv., SRO","m³/h.",{"$f":"Genanskaffelsespriser!$E$57","v":10},0,null,null,0,"",null,{"$f":"IF(E129=0,\"Variabel pris\",IFERROR((HLOOKUP(E129,'Variable priser'!$C$108:$E$110,2)+(E129-HLOOKUP(E129,'Variable priser'!$C$108:$E$110,1))*HLOOKUP(E129,'Variable priser'!$C$108:$E$110,3))/E129*'Variable priser'!$I$109*(1+Genanskaffelsespriser!$D$203),\"Fejl\"))","v":"Variabel pris"},{"$f":"IF(F129=0,\"Variabel pris\",IFERROR((HLOOKUP(F129,'Variable priser'!$C$108:$E$110,2)+(F129-HLOOKUP(F129,'Variable priser'!$C$108:$E$110,1))*HLOOKUP(F129,'Variable priser'!$C$108:$E$110,3))/F129*'Variable priser'!$I$109*(1+Genanskaffelsespriser!$D$203),\"Fejl\"))","v":"Variabel pris"},"","",1,1]
["Nødstrømsanlæg på vandværk","kW",{"$f":"Genanskaffelsespriser!$E$58","v":25},0,null,null,0,"",null,{"$f":"IF(E130=0,\"Variabel pris\",IFERROR((HLOOKUP(E130,'Variable priser'!$C$86:$H$88,2)+(E130-HLOOKUP(E130,'Variable priser'!$C$86:$H$88,1))*HLOOKUP(E130,'Variable priser'!$C$86:$H$88,3))/E130*(1+Genanskaffelsespriser!$D$203),\"Fejl\"))","v":"Variabel pris"},{"$f":"IF(F130=0,\"Variabel pris\",IFERROR((HLOOKUP(F130,'Variable priser'!$C$86:$H$88,2)+(F130-HLOOKUP(F130,'Variable priser'!$C$86:$H$88,1))*HLOOKUP(F130,'Variable priser'!$C$86:$H$88,3))/F130*(1+Genanskaffelsespriser!$D$203),\"Fejl\"))","v":"Variabel pris"},"","",1,1]
["Elanlæg og SRO-anlæg - vandværk, Elanlæg","m³/h.",{"$f":"Genanskaffelsespriser!$E$59","v":25},0,null,null,0,"",null,{"$f":"IF(E131=0,\"Variabel pris\",IFERROR((HLOOKUP(E131,'Variable priser'!$C$91:$J$95,4)+(E131-HLOOKUP(E131,'Variable priser'!$C$91:$J$95,1))*HLOOKUP(E131,'Variable priser'!$C$91:$J$95,5))/E131*(1+Genanskaffelsespriser!$D$203),\"Fejl\"))","v":"Variabel pris"},{"$f":"IF(F131=0,\"Variabel pris\",IFERROR((HLOOKUP(F131,'Variable priser'!$C$91:$J$95,4)+(F131-HLOOKUP(F131,'Variable priser'!$C$91:$J$95,1))*HLOOKUP(F131,'Variable priser'!$C$91:$J$95,5))/F131*(1+Genanskaffelsespriser!$D$203),\"Fejl\"))","v":"Variabel pris"},"","",1,1]
["Elanlæg og SRO-anlæg - vandværk, SRO","m³/h.",{"$f":"Genanskaffelsespriser!$E$60","v":10},0,null,null,0,"",null,{"$f":"IF(E132=0,\"Variabel pris\",IFERROR((HLOOKUP(E132,'Variable priser'!$C$91:$J$98,7)+(E132-HLOOKUP(E132,'Variable priser'!$C$91:$J$98,1))*HLOOKUP(E132,'Variable priser'!$C$91:$J$98,8))/E132*(1+Genanskaffelsespriser!$D$203),\"Fejl\"))","v":"Variabel pris"},{"$f":"IF(F132=0,\"Variabel pris\",IFERROR((HLOOKUP(F132,'Variable priser'!$C$91:$J$98,7)+(F132-HLOOKUP(F132,'Variable priser'!$C$91:$J$98,1))*HLOOKUP(F132,'Variable priser'!$C$91:$J$98,8))/F132*(1+Genanskaffelsespriser!$D$203),\"Fejl\"))","v":"Variabel pris"},"","",1,1]
["Vandværk 4"]
["Beluftningsanlæg, iltningstrappe, Konstruktioner","m³/h ",{"$f":"Genanskaffelsespriser!$E$30","v":50},0,0,0,{"$f":"IF($D134=\"\",IF($E134>0,\"Ny data\",IF($E134=\"\",\"\",0)),IF($D134=0,IF($E134=0,0,\"Ny data\"),($E134-$D134)/$D134))","v":0},0,null,{"$f":"IF(E134=0,\"Variabel pris\",IFERROR((HLOOKUP(E134,'Variable priser'!$C$6:$H$16,2)+(E134-HLOOKUP(E134,'Variable priser'!$C$6:$H$16,1))*HLOOKUP(E134,'Variable priser'!$C$6:$H$16,3))/E134*'Variable priser'!$K$7*(1+Genanskaffelsespriser!$D$203),\"Fejl\"))","v":"Variabel pris"},{"$f":"IF(F134=0,\"Variabel pris\",IFERROR((HLOOKUP(F134,'Variable priser'!$C$6:$H$16,2)+(F134-HLOOKUP(F134,'Variable priser'!$C$6:$H$16,1))*HLOOKUP(F134,'Variable priser'!$C$6:$H$16,3))/F134*'Variable priser'!$K$7*(1+Genanskaffelsespriser!$D$203),\"Fejl\"))","v":"Variabel pris"},{"$f":"IF(ISBLANK(E134),\"\",IF(E134=0,\"\",IF(ISNUMBER(E134),((J134*E134)/C134)*N134,\"\")))","v":""},{"$f":"IF(ISBLANK(F134),\"\",IF(F134=0,\"\",IF(ISNUMBER(F134),((K134*F134)/C134)*N134,\"\")))","v":""},1,1]
["Beluftningsanlæg, iltningstrappe, Mek./EL","m³/h ",{"$f":"Genanskaffelsespriser!$E$31","v":25},0,0,0,0,{"$f":"IF($E135=\"\",IF($F135>0,\"Ny data\",IF($F135=\"\",\"\",0)),IF($E135=0,IF($F135=0,0,\"Ny data\"),($F135-$E135)/$E135))","v":0},null,{"$f":"IF(E135=0,\"Variabel pris\",IFERROR((HLOOKUP(E135,'Variable priser'!$C$6:$H$16,2)+(E135-HLOOKUP(E135,'Variable priser'!$C$6:$H$16,1))*HLOOKUP(E135,'Variable priser'!$C$6:$H$16,3))/E135*'Variable priser'!$L$7*(1+Genanskaffelsespriser!$D$203),\"Fejl\"))","v":"Variabel pris"},{"$f":"IF(F135=0,\"Variabel pris\",IFERROR((HLOOKUP(F135,'Variable priser'!$C$6:$H$16,2)+(F135-HLOOKUP(F135,'Variable priser'!$C$6:$H$16,1))*HLOOKUP(F135,'Variable priser'!$C$6:$H$16,3))/F135*'Variable priser'!$L$7*(1+Genanskaffelsespriser!$D$203),\"Fejl\"))","v":"Variabel pris"},{"$f":"IF(ISBLANK(E135),\"\",IF(E135=0,\"\",IF(ISNUMBER(E135),((J135*E135)/C135)*N135,\"\")))","v":""},{"$f":"IF(ISBLANK(F135),\"\",IF(F135=0,\"\",IF(ISNUMBER(F135),((K135*F135)/C135)*N135,\"\")))","v":""},1,1]
["Beluftningsanlæg, ika-beluftning, Konstruktioner","m³/h ",{"$f":"Genanskaffelsespriser!$E$32","v":50},0,0,0,0,0,null,{"$f":"IF(E136=0,\"Variabel pris\",IFERROR((HLOOKUP(E136,'Variable priser'!$C$6:$H$16,4)+(E136-HLOOKUP(E136,'Variable priser'!$C$6:$H$16,1))*HLOOKUP(E136,'Variable priser'!$C$6:$H$16,5))/E136*'Variable priser'!$K$9*(1+Genanskaffelsespriser!$D$203),\"Fejl\"))","v":"Variabel pris"},{"$f":"IF(F136=0,\"Variabel pris\",IFERROR((HLOOKUP(F136,'Variable priser'!$C$6:$H$16,4)+(F136-HLOOKUP(F136,'Variable priser'!$C$6:$H$16,1))*HLOOKUP(F136,'Variable priser'!$C$6:$H$16,5))/F136*'Variable priser'!$K$9*(1+Genanskaffelsespriser!$D$203),\"Fejl\"))","v":"Variabel pris"},"","",1,1]
["Beluftningsanlæg, ika-beluftning, Mek./EL","m³/h ",{"$f":"Genanskaffelsespriser!$E$33","v":25},0,0,0,0,0,null,{"$f":"IF(E137=0,\"Variabel pris\",IFERROR((HLOOKUP(E137,'Variable priser'!$C$6:$H$16,4)+(E137-HLOOKUP(E137,'Variable priser'!$C$6:$H$16,1))*HLOOKUP(E137,'Variable priser'!$C$6:$H$16,5))/E137*'Variable priser'!$L$9*(1+Genanskaffelsespriser!$D$203),\"Fejl\"))","v":"Variabel pris"},{"$f":"IF(F137=0,\"Variabel pris\",IFERROR((HLOOKUP(F137,'Variable priser'!$C$6:$H$16,4)+(F137-HLOOKUP(F137,'Variable priser'!$C$6:$H$16,1))*HLOOKUP(F137,'Variable priser'!$C$6:$H$16,5))/F137*'Variable priser'!$L$9*(1+Genanskaffelsespriser!$D$203),\"Fejl\"))","v":"Variabel pris"},"","",1,1]
["Beluftningsanlæg, bundbeluftbning, Konstruktioner","m³/h ",{"$f":"Genanskaffelsespriser!$E$34","v":50},44,44,44,0,0,null,{"$f":"IF(E138=0,\"Variabel pris\",IFERROR((HLOOKUP(E138,'Variable priser'!$C$6:$H$16,6)+(E138-HLOOKUP(E138,'Variable priser'!$C$6:$H$16,1))*HLOOKUP(E138,'Variable priser'!$C$6:$H$16,7))/E138*'Variable priser'!$K$17*(1+Genanskaffelsespriser!$D$203),\"Fejl\"))","v":3490.4680945183622},{"$f":"IF(F138=0,\"Variabel pris\",IFERROR((HLOOKUP(F138,'Variable priser'!$C$6:$H$16,6)+(F138-HLOOKUP(F138,'Variable priser'!$C$6:$H$16,1))*HLOOKUP(F138,'Variable priser'!$C$6:$H$16,7))/F138*'Variable priser'!$K$17*(1+Genanskaffelsespriser!$D$203),\"Fejl\"))","v":3490.4680945183622},3071.6119231761591,3071.6119231761591,1,1]
["Beluftningsanlæg, bundbeluftbning, Mek./EL","m³/h ",{"$f":"Genanskaffelsespriser!$E$35","v":25},44,44,44,0,0,null,{"$f":"IF(E139=0,\"Variabel pris\",IFERROR((HLOOKUP(E139,'Variable priser'!$C$6:$H$16,6)+(E139-HLOOKUP(E139,'Variable priser'!$C$6:$H$16,1))*HLOOKUP(E139,'Variable priser'!$C$6:$H$16,7))/E139*'Variable priser'!$L$17*(1+Genanskaffelsespriser!$D$203),\"Fejl\"))","v":1495.914897650727},{"$f":"IF(F139=0,\"Variabel pris\",IFERROR((HLOOKUP(F139,'Variable priser'!$C$6:$H$16,6)+(F139-HLOOKUP(F139,'Variable priser'!$C$6:$H$16,1))*HLOOKUP(F139,'Variable priser'!$C$6:$H$16,7))/F139*'Variable priser'!$L$17*(1+Genanskaffelsespriser!$D$203),\"Fejl\"))","v":1495.914897650727},2632.8102198652796,2632.8102198652796,1,1]
["Beluftningsanlæg, rislebakke, Konstruktioner","m³/h ",{"$f":"Genanskaffelsespriser!$E$36","v":50},0,0,0,0,0,null,{"$f":"IF(E140=0,\"Variabel pris\",IFERROR((HLOOKUP(E140,'Variable priser'!$C$6:$H$18,12)+(E140-HLOOKUP(E140,'Variable priser'!$C$6:$H$18,1))*HLOOKUP(E140,'Variable priser'!$C$6:$H$18,13))/E140*'Variable priser'!$K$17*(1+Genanskaffelsespriser!$D$203),\"Fejl\"))","v":"Variabel pris"},{"$f":"IF(F140=0,\"Variabel pris\",IFERROR((HLOOKUP(F140,'Variable priser'!$C$6:$H$18,12)+(F140-HLOOKUP(F140,'Variable priser'!$C$6:$H$18,1))*HLOOKUP(F140,'Variable priser'!$C$6:$H$18,13))/F140*'Variable priser'!$K$17*(1+Genanskaffelsespriser!$D$203),\"Fejl\"))","v":"Variabel pris"},"","",1,1]
["Beluftningsanlæg, rislebakke, Mek./EL","m³/h ",{"$f":"Genanskaffelsespriser!$E$37","v":25},0,0,0,0,0,null,{"$f":"IF(E141=0,\"Variabel pris\",IFERROR((HLOOKUP(E141,'Variable priser'!$C$6:$H$18,12)+(E141-HLOOKUP(E141,'Variable priser'!$C$6:$H$18,1))*HLOOKUP(E141,'Variable priser'!$C$6:$H$18,13))/E141*'Variable priser'!$L$17*(1+Genanskaffelsespriser!$D$203),\"Fejl\"))","v":"Variabel pris"},{"$f":"IF(F141=0,\"Variabel pris\",IFERROR((HLOOKUP(F141,'Variable priser'!$C$6:$H$18,12)+(F141-HLOOKUP(F141,'Variable priser'!$C$6:$H$18,1))*HLOOKUP(F141,'Variable priser'!$C$6:$H$18,13))/F141*'Variable priser'!$L$17*(1+Genanskaffelsespriser!$D$203),\"Fejl\"))","v":"Variabel pris"},"","",1,1]
["Beluftningsanlæg, kompressorbeluftning","m³/h ",{"$f":"Genanskaffelsespriser!$E$38","v":25},0,0,0,0,0,null,{"$f":"IF(E142=0,\"Variabel pris\",IFERROR((HLOOKUP(E142,'Variable priser'!$C$6:$H$16,8)+(E142-HLOOKUP(E142,'Variable priser'!$C$6:$H$16,1))*HLOOKUP(E142,'Variable priser'!$C$6:$H$16,9))/E142*(1+Genanskaffelsespriser!$D$203),\"Fejl\"))","v":"Variabel pris"},{"$f":"IF(F142=0,\"Variabel pris\",IFERROR((HLOOKUP(F142,'Variable priser'!$C$6:$H$16,8)+(F142-HLOOKUP(F142,'Variable priser'!$C$6:$H$16,1))*HLOOKUP(F142,'Variable priser'!$C$6:$H$16,9))/F142*(1+Genanskaffelsespriser!$D$203),\"Fejl\"))","v":"Variabel pris"},"","",1,1]
["Beluftningsanlæg, ren ilt","m³/h ",{"$f":"Genanskaffelsespriser!$E$39","v":25},0,0,0,0,0,null,{"$f":"IF(E143=0,\"Variabel pris\",IFERROR((HLOOKUP(E143,'Variable priser'!$C$6:$H$16,10)+(E143-HLOOKUP(E143,'Variable priser'!$C$6:$H$16,1))*HLOOKUP(E143,'Variable priser'!$C$6:$H$16,11))/E143*(1+Genanskaffelsespriser!$D$203),\"Fejl\"))","v":"Variabel pris"},{"$f":"IF(F143=0,\"Variabel pris\",IFERROR((HLOOKUP(F143,'Variable priser'!$C$6:$H$16,10)+(F143-HLOOKUP(F143,'Variable priser'!$C$6:$H$16,1))*HLOOKUP(F143,'Variable priser'!$C$6:$H$16,11))/F143*(1+Genanskaffelsespriser!$D$203),\"Fejl\"))","v":"Variabel pris"},"","",1,1]
["Behandlingsanlæg, kalk anlæg","m³/h ",{"$f":"Genanskaffelsespriser!$E$40","v":25},0,0,0,0,0,null,{"$f":"IF(E144=0,\"Variabel pris\",IFERROR((HLOOKUP(E144,'Variable priser'!$C$20:$G$24,3)+(E144-HLOOKUP(E144,'Variable priser'!$C$20:$G$24,1))*HLOOKUP(E144,'Variable priser'!$C$20:$G$24,4))/E144*(1+Genanskaffelsespriser!$D$203),\"Fejl\"))","v":"Variabel pris"},{"$f":"IF(F144=0,\"Variabel pris\",IFERROR((HLOOKUP(F144,'Variable priser'!$C$20:$G$24,3)+(F144-HLOOKUP(F144,'Variable priser'!$C$20:$G$24,1))*HLOOKUP(F144,'Variable priser'!$C$20:$G$24,4))/F144*(1+Genanskaffelsespriser!$D$203),\"Fejl\"))","v":"Variabel pris"},"","",1,1]
["Behandlingsanlæg, luddosering","m³/h ",{"$f":"Genanskaffelsespriser!$E$41","v":25},0,0,0,0,0,null,{"$f":"IF(E145=0,\"Variabel pris\",IFERROR((HLOOKUP(E145,'Variable priser'!$C$20:$G$25,5)+(E145-HLOOKUP(E145,'Variable priser'!$C$20:$G$25,1))*HLOOKUP(E145,'Variable priser'!$C$20:$G$25,6))/E145*(1+Genanskaffelsespriser!$D$203),\"Fejl\"))","v":"Variabel pris"},{"$f":"IF(F145=0,\"Variabel pris\",IFERROR((HLOOKUP(F145,'Variable priser'!$C$20:$G$25,5)+(F145-HLOOKUP(F145,'Variable priser'!$C$20:$G$25,1))*HLOOKUP(F145,'Variable priser'!$C$20:$G$25,6))/F145*(1+Genanskaffelsespriser!$D$203),\"Fejl\"))","v":"Variabel pris"},"","",1,1]
["Filteranlæg, åbne filtre, enkelt filtrering, Konstruktioner","m³/h ",{"$f":"Genanskaffelsespriser!$E$42","v":50},0,0,0,0,0,null,{"$f":"IF(E146=0,\"Variabel pris\",IFERROR((HLOOKUP(E146,'Variable priser'!$C$28:$G$38,9)+(E146-HLOOKUP(E146,'Variable priser'!$C$28:$G$38,1))*HLOOKUP(E146,'Variable priser'!$C$28:$G$38,10))/E146*'Variable priser'!$K$31*(1+Genanskaffelsespriser!$D$203),\"Fejl\"))","v":"Variabel pris"},{"$f":"IF(F146=0,\"Variabel pris\",IFERROR((HLOOKUP(F146,'Variable priser'!$C$28:$G$38,9)+(F146-HLOOKUP(F146,'Variable priser'!$C$28:$G$38,1))*HLOOKUP(F146,'Variable priser'!$C$28:$G$38,10))/F146*'Variable priser'!$K$31*(1+Genanskaffelsespriser!$D$203),\"Fejl\"))","v":"Variabel pris"},"","",1,1]
["Filteranlæg, åbne filtre, enkelt filtrering, Mek./EL","m³/h ",{"$f":"Genanskaffelsespriser!$E$43","v":25},0,0,0,0,0,null,{"$f":"IF(E147=0,\"Variabel pris\",IFERROR((HLOOKUP(E147,'Variable priser'!$C$28:$G$38,9)+(E147-HLOOKUP(E147,'Variable priser'!$C$28:$G$38,1))*HLOOKUP(E147,'Variable priser'!$C$28:$G$38,10))/E147*'Variable priser'!$L$31*(1+Genanskaffelsespriser!$D$203),\"Fejl\"))","v":"Variabel pris"},{"$f":"IF(F147=0,\"Variabel pris\",IFERROR((HLOOKUP(F147,'Variable priser'!$C$28:$G$38,9)+(F147-HLOOKUP(F147,'Variable priser'!$C$28:$G$38,1))*HLOOKUP(F147,'Variable priser'!$C$28:$G$38,10))/F147*'Variable priser'!$L$31*(1+Genanskaffelsespriser!$D$203),\"Fejl\"))","v":"Variabel pris"},"","",1,1]
["Filteranlæg, åbne filtre, dobbelt filtrering, Konstruktioner","m³/h ",{"$f":"Genanskaffelsespriser!$E$44","v":50},44,44,44,0,0,null,{"$f":"IF(E148=0,\"Variabel pris\",IFERROR((HLOOKUP(E148,'Variable priser'!$C$28:$G$38,6)+(E148-HLOOKUP(E148,'Variable priser'!$C$28:$G$38,1))*HLOOKUP(E148,'Variable priser'!$C$28:$G$38,7))/E148*'Variable priser'!$K$31*(1+Genanskaffelsespriser!$D$203),\"Fejl\"))","v":12869.579822399997},{"$f":"IF(F148=0,\"Variabel pris\",IFERROR((HLOOKUP(F148,'Variable priser'!$C$28:$G$38,6)+(F148-HLOOKUP(F148,'Variable priser'!$C$28:$G$38,1))*HLOOKUP(F148,'Variable priser'!$C$28:$G$38,7))/F148*'Variable priser'!$K$31*(1+Genanskaffelsespriser!$D$203),\"Fejl\"))","v":12869.579822399997},11325.230243711998,11325.230243711998,1,1]
["Filteranlæg, åbne filtre, dobbelt filtrering, Mek./EL","m³/h ",{"$f":"Genanskaffelsespriser!$E$45","v":25},44,44,44,0,0,null,{"$f":"IF(E149=0,\"Variabel pris\",IFERROR((HLOOKUP(E149,'Variable priser'!$C$28:$G$38,6)+(E149-HLOOKUP(E149,'Variable priser'!$C$28:$G$38,1))*HLOOKUP(E149,'Variable priser'!$C$28:$G$38,7))/E149*'Variable priser'!$L$31*(1+Genanskaffelsespriser!$D$203),\"Fejl\"))","v":19304.369733599997},{"$f":"IF(F149=0,\"Variabel pris\",IFERROR((HLOOKUP(F149,'Variable priser'!$C$28:$G$38,6)+(F149-HLOOKUP(F149,'Variable priser'!$C$28:$G$38,1))*HLOOKUP(F149,'Variable priser'!$C$28:$G$38,7))/F149*'Variable priser'!$L$31*(1+Genanskaffelsespriser!$D$203),\"Fejl\"))","v":19304.369733599997},33975.69073113599,33975.69073113599,1,1]
["Filteranlæg, trykfiltre, enkelt filtrering","m³/h ",{"$f":"Genanskaffelsespriser!$E$46","v":25},0,0,0,0,0,null,{"$f":"IF(E150=0,\"Variabel pris\",IFERROR((HLOOKUP(E150,'Variable priser'!$C$40:$H$42,2)+(E150-HLOOKUP(E150,'Variable priser'!$C$40:$H$42,1))*HLOOKUP(E150,'Variable priser'!$C$40:$H$42,3))/E150*(1+Genanskaffelsespriser!$D$203),\"Fejl\"))","v":"Variabel pris"},{"$f":"IF(F150=0,\"Variabel pris\",IFERROR((HLOOKUP(F150,'Variable priser'!$C$40:$H$42,2)+(F150-HLOOKUP(F150,'Variable priser'!$C$40:$H$42,1))*HLOOKUP(F150,'Variable priser'!$C$40:$H$42,3))/F150*(1+Genanskaffelsespriser!$D$203),\"Fejl\"))","v":"Variabel pris"},"","",1,1]
["Filteranlæg, trykfiltre, dobbelt filtrering","m³/h ",{"$f":"Genanskaffelsespriser!$E$47","v":25},0,0,0,0,0,null,{"$f":"IF(E151=0,\"Variabel pris\",IFERROR((HLOOKUP(E151,'Variable priser'!$C$44:$H$46,2)+(E151-HLOOKUP(E151,'Variable priser'!$C$44:$H$46,1))*HLOOKUP(E151,'Variable priser'!$C$44:$H$46,3))/E151*(1+Genanskaffelsespriser!$D$203),\"Fejl\"))","v":"Variabel pris"},{"$f":"IF(F151=0,\"Variabel pris\",IFERROR((HLOOKUP(F151,'Variable priser'!$C$44:$H$46,2)+(F151-HLOOKUP(F151,'Variable priser'!$C$44:$H$46,1))*HLOOKUP(F151,'Variable priser'!$C$44:$H$46,3))/F151*(1+Genanskaffelsespriser!$D$203),\"Fejl\"))","v":"Variabel pris"},"","",1,1]
["Rentvandsbeholder  insitu støbt","m³",{"$f":"Genanskaffelsespriser!$E$48","v":50},200,200,200,0,0,null,{"$f":"IF(E152=0,\"Variabel pris\",IFERROR((HLOOKUP(E152,'Variable priser'!$C$48:$H$50,2)+(E152-HLOOKUP(E152,'Variable priser'!$C$48:$H$50,1))*HLOOKUP(E152,'Variable priser'!$C$48:$H$50,3))/E152*(1+Genanskaffelsespriser!$D$203),\"Fejl\"))","v":5062.7325149999997},{"$f":"IF(F152=0,\"Variabel pris\",IFERROR((HLOOKUP(F152,'Variable priser'!$C$48:$H$50,2)+(F152-HLOOKUP(F152,'Variable priser'!$C$48:$H$50,1))*HLOOKUP(F152,'Variable priser'!$C$48:$H$50,3))/F152*(1+Genanskaffelsespriser!$D$203),\"Fejl\"))","v":5062.7325149999997},20250.930059999999,20250.930059999999,1,1]
["Rentvandsbeholder  element","m³",{"$f":"Genanskaffelsespriser!$E$49","v":50},0,0,0,0,0,null,{"$f":"IF(E153=0,\"Variabel pris\",IFERROR((HLOOKUP(E153,'Variable priser'!$C$52:$H$54,2)+(E153-HLOOKUP(E153,'Variable priser'!$C$52:$H$54,1))*HLOOKUP(E153,'Variable priser'!$C$52:$H$54,3))/E153*(1+Genanskaffelsespriser!$D$203),\"Fejl\"))","v":"Variabel pris"},{"$f":"IF(F153=0,\"Variabel pris\",IFERROR((HLOOKUP(F153,'Variable priser'!$C$52:$H$54,2)+(F153-HLOOKUP(F153,'Variable priser'!$C$52:$H$54,1))*HLOOKUP(F153,'Variable priser'!$C$52:$H$54,3))/F153*(1+Genanskaffelsespriser!$D$203),\"Fejl\"))","v":"Variabel pris"},"","",1,1]
["Udpumpningsanlæg, rentvandspumper på vandværk","m³/h ",{"$f":"Genanskaffelsespriser!$E$50","v":25},150,150,150,0,0,null,{"$f":"IF(E154=0,\"Variabel pris\",IFERROR((HLOOKUP(E154,'Variable priser'!$C$71:$H$73,2)+(E154-HLOOKUP(E154,'Variable priser'!$C$71:$H$73,1))*HLOOKUP(E154,'Variable priser'!$C$71:$H$73,3))/E154*(1+Genanskaffelsespriser!$D$203),\"Fejl\"))","v":1324.499032222222},{"$f":"IF(F154=0,\"Variabel pris\",IFERROR((HLOOKUP(F154,'Variable priser'!$C$71:$H$73,2)+(F154-HLOOKUP(F154,'Variable priser'!$C$71:$H$73,1))*HLOOKUP(F154,'Variable priser'!$C$71:$H$73,3))/F154*(1+Genanskaffelsespriser!$D$203),\"Fejl\"))","v":1324.499032222222},7946.9941933333312,7946.9941933333312,1,1]
["Udpumpningsanlæg, frekvensomformer","kW",{"$f":"Genanskaffelsespriser!$E$51","v":25},10,10,10,0,0,null,{"$f":"IF(E155=0,\"Variabel pris\",IFERROR((HLOOKUP(E155,'Variable priser'!$C$76:$J$78,2)+(E155-HLOOKUP(E155,'Variable priser'!$C$76:$J$78,1))*HLOOKUP(E155,'Variable priser'!$C$76:$J$78,3))/E155*(1+Genanskaffelsespriser!$D$203),\"Fejl\"))","v":8813.326116000002},{"$f":"IF(F155=0,\"Variabel pris\",IFERROR((HLOOKUP(F155,'Variable priser'!$C$76:$J$78,2)+(F155-HLOOKUP(F155,'Variable priser'!$C$76:$J$78,1))*HLOOKUP(F155,'Variable priser'!$C$76:$J$78,3))/F155*(1+Genanskaffelsespriser!$D$203),\"Fejl\"))","v":8813.326116000002},3525.3304464000012,3525.3304464000012,1,1]
["Udpumpningsanlæg, Hydrofor","liter",{"$f":"Genanskaffelsespriser!$E$52","v":25},0,0,0,0,0,null,{"$f":"IF(E156=0,\"Variabel pris\",IFERROR((HLOOKUP(E156,'Variable priser'!$C$81:$J$83,2)+(E156-HLOOKUP(E156,'Variable priser'!$C$81:$J$83,1))*HLOOKUP(E156,'Variable priser'!$C$81:$J$83,3))/E156*(1+Genanskaffelsespriser!$D$203),\"Fejl\"))","v":"Variabel pris"},{"$f":"IF(F156=0,\"Variabel pris\",IFERROR((HLOOKUP(F156,'Variable priser'!$C$81:$J$83,2)+(F156-HLOOKUP(F156,'Variable priser'!$C$81:$J$83,1))*HLOOKUP(F156,'Variable priser'!$C$81:$J$83,3))/F156*(1+Genanskaffelsespriser!$D$203),\"Fejl\"))","v":"Variabel pris"},"","",1,1]
["Skyllevand-/slamhåndteringsanlæg - lukkede betonbeholdere","m³",{"$f":"Genanskaffelsespriser!$E$53","v":50},20,20,20,0,0,null,{"$f":"IF(E157=0,\"Variabel pris\",IFERROR((HLOOKUP(E157,'Variable priser'!$C$59:$H$61,2)+(E157-HLOOKUP(E157,'Variable priser'!$C$59:$H$61,1))*HLOOKUP(E157,'Variable priser'!$C$59:$H$61,3))/E157*(1+Genanskaffelsespriser!$D$203),\"Fejl\"))","v":5400.2480159999986},{"$f":"IF(F157=0,\"Variabel pris\",IFERROR((HLOOKUP(F157,'Variable priser'!$C$59:$H$61,2)+(F157-HLOOKUP(F157,'Variable priser'!$C$59:$H$61,1))*HLOOKUP(F157,'Variable priser'!$C$59:$H$61,3))/F157*(1+Genanskaffelsespriser!$D$203),\"Fejl\"))","v":5400.2480159999986},2160.0992063999993,2160.0992063999993,1,1]
["Skyllevand-/slamhåndteringsanl. - åbne med faste sider/bund","m³",{"$f":"Genanskaffelsespriser!$E$54","v":50},0,0,0,0,0,null,{"$f":"IF(E158=0,\"Variabel pris\",IFERROR((HLOOKUP(E158,'Variable priser'!$C$59:$H$64,5)+(E158-HLOOKUP(E158,'Variable priser'!$C$59:$H$64,1))*HLOOKUP(E158,'Variable priser'!$C$59:$H$64,6))/E158*(1+Genanskaffelsespriser!$D$203),\"Fejl\"))","v":"Variabel pris"},{"$f":"IF(F158=0,\"Variabel pris\",IFERROR((HLOOKUP(F158,'Variable priser'!$C$59:$H$64,5)+(F158-HLOOKUP(F158,'Variable priser'!$C$59:$H$64,1))*HLOOKUP(F158,'Variable priser'!$C$59:$H$64,6))/F158*(1+Genanskaffelsespriser!$D$203),\"Fejl\"))","v":"Variabel pris"},"","",1,1]
["Skyllevand-/slamhåndteringsanlæg - jordbassiner","m³",{"$f":"Genanskaffelsespriser!$E$55","v":50},0,0,0,0,0,null,{"$f":"IF(E159=0,\"Variabel pris\",IFERROR((HLOOKUP(E159,'Variable priser'!$C$59:$H$67,8)+(E159-HLOOKUP(E159,'Variable priser'!$C$59:$H$67,1))*HLOOKUP(E159,'Variable priser'!$C$59:$H$67,9))/E159*(1+Genanskaffelsespriser!$D$203),\"Fejl\"))","v":"Variabel pris"},{"$f":"IF(F159=0,\"Variabel pris\",IFERROR((HLOOKUP(F159,'Variable priser'!$C$59:$H$67,8)+(F159-HLOOKUP(F159,'Variable priser'!$C$59:$H$67,1))*HLOOKUP(F159,'Variable priser'!$C$59:$H$67,9))/F159*(1+Genanskaffelsespriser!$D$203),\"Fejl\"))","v":"Variabel pris"},"","",1,1]
["Skyllevandsbehandling, inkl. UV-filter mv., Mek./EL","m³/h.",{"$f":"Genanskaffelsespriser!$E$56","v":25},5,5,5,0,0,null,{"$f":"IF(E160=0,\"Variabel pris\",IFERROR((HLOOKUP(E160,'Variable priser'!$C$108:$E$110,2)+(E160-HLOOKUP(E160,'Variable priser'!$C$108:$E$110,1))*HLOOKUP(E160,'Variable priser'!$C$108:$E$110,3))/E160*'Variable priser'!$H$109*(1+Genanskaffelsespriser!$D$203),\"Fejl\"))","v":22725.411682499998},{"$f":"IF(F160=0,\"Variabel pris\",IFERROR((HLOOKUP(F160,'Variable priser'!$C$108:$E$110,2)+(F160-HLOOKUP(F160,'Variable priser'!$C$108:$E$110,1))*HLOOKUP(F160,'Variable priser'!$C$108:$E$110,3))/F160*'Variable priser'!$H$109*(1+Genanskaffelsespriser!$D$203),\"Fejl\"))","v":22725.411682499998},4545.0823364999997,4545.0823364999997,1,1]
["Skyllevandsbehandling, inkl. UV-filter mv., SRO","m³/h.",{"$f":"Genanskaffelsespriser!$E$57","v":10},5,5,5,0,0,null,{"$f":"IF(E161=0,\"Variabel pris\",IFERROR((HLOOKUP(E161,'Variable priser'!$C$108:$E$110,2)+(E161-HLOOKUP(E161,'Variable priser'!$C$108:$E$110,1))*HLOOKUP(E161,'Variable priser'!$C$108:$E$110,3))/E161*'Variable priser'!$I$109*(1+Genanskaffelsespriser!$D$203),\"Fejl\"))","v":4010.3667674999992},{"$f":"IF(F161=0,\"Variabel pris\",IFERROR((HLOOKUP(F161,'Variable priser'!$C$108:$E$110,2)+(F161-HLOOKUP(F161,'Variable priser'!$C$108:$E$110,1))*HLOOKUP(F161,'Variable priser'!$C$108:$E$110,3))/F161*'Variable priser'!$I$109*(1+Genanskaffelsespriser!$D$203),\"Fejl\"))","v":4010.3667674999992},2005.1833837499994,2005.1833837499994,1,1]
["Nødstrømsanlæg på vandværk","kW",{"$f":"Genanskaffelsespriser!$E$58","v":25},0,0,0,0,0,null,{"$f":"IF(E162=0,\"Variabel pris\",IFERROR((HLOOKUP(E162,'Variable priser'!$C$86:$H$88,2)+(E162-HLOOKUP(E162,'Variable priser'!$C$86:$H$88,1))*HLOOKUP(E162,'Variable priser'!$C$86:$H$88,3))/E162*(1+Genanskaffelsespriser!$D$203),\"Fejl\"))","v":"Variabel pris"},{"$f":"IF(F162=0,\"Variabel pris\",IFERROR((HLOOKUP(F162,'Variable priser'!$C$86:$H$88,2)+(F162-HLOOKUP(F162,'Variable priser'!$C$86:$H$88,1))*HLOOKUP(F162,'Variable priser'!$C$86:$H$88,3))/F162*(1+Genanskaffelsespriser!$D$203),\"Fejl\"))","v":"Variabel pris"},"","",1,1]
["Elanlæg og SRO-anlæg - vandværk, Elanlæg","m³/h.",{"$f":"Genanskaffelsespriser!$E$59","v":25},44,44,44,0,0,null,{"$f":"IF(E163=0,\"Variabel pris\",IFERROR((HLOOKUP(E163,'Variable priser'!$C$91:$J$95,4)+(E163-HLOOKUP(E163,'Variable priser'!$C$91:$J$95,1))*HLOOKUP(E163,'Variable priser'!$C$91:$J$95,5))/E163*(1+Genanskaffelsespriser!$D$203),\"Fejl\"))","v":7888.0027199999995},{"$f":"IF(F163=0,\"Variabel pris\",IFERROR((HLOOKUP(F163,'Variable priser'!$C$91:$J$95,4)+(F163-HLOOKUP(F163,'Variable priser'!$C$91:$J$95,1))*HLOOKUP(F163,'Variable priser'!$C$91:$J$95,5))/F163*(1+Genanskaffelsespriser!$D$203),\"Fejl\"))","v":7888.0027199999995},13882.884787200001,13882.884787200001,1,1]
["Elanlæg og SRO-anlæg - vandværk, SRO","m³/h.",{"$f":"Genanskaffelsespriser!$E$60","v":10},44,44,44,0,0,null,{"$f":"IF(E164=0,\"Variabel pris\",IFERROR((HLOOKUP(E164,'Variable priser'!$C$91:$J$98,7)+(E164-HLOOKUP(E164,'Variable priser'!$C$91:$J$98,1))*HLOOKUP(E164,'Variable priser'!$C$91:$J$98,8))/E164*(1+Genanskaffelsespriser!$D$203),\"Fejl\"))","v":6067.6943999999994},{"$f":"IF(F164=0,\"Variabel pris\",IFERROR((HLOOKUP(F164,'Variable priser'!$C$91:$J$98,7)+(F164-HLOOKUP(F164,'Variable priser'!$C$91:$J$98,1))*HLOOKUP(F164,'Variable priser'!$C$91:$J$98,8))/F164*(1+Genanskaffelsespriser!$D$203),\"Fejl\"))","v":6067.6943999999994},26697.855359999998,26697.855359999998,1,1]
["Vandværk 5"]
["Beluftningsanlæg, iltningstrappe, Konstruktioner","m³/h ",{"$f":"Genanskaffelsespriser!$E$30","v":50},0,0,0,{"$f":"IF($D166=\"\",IF($E166>0,\"Ny data\",IF($E166=\"\",\"\",0)),IF($D166=0,IF($E166=0,0,\"Ny data\"),($E166-$D166)/$D166))","v":0},{"$f":"IF($E166=\"\",IF($F166>0,\"Ny data\",IF($F166=\"\",\"\",0)),IF($E166=0,IF($F166=0,0,\"Ny data\"),($F166-$E166)/$E166))","v":0},null,{"$f":"IF(E166=0,\"Variabel pris\",IFERROR((HLOOKUP(E166,'Variable priser'!$C$6:$H$16,2)+(E166-HLOOKUP(E166,'Variable priser'!$C$6:$H$16,1))*HLOOKUP(E166,'Variable priser'!$C$6:$H$16,3))/E166*'Variable priser'!$K$7*(1+Genanskaffelsespriser!$D$203),\"Fejl\"))","v":"Variabel pris"},{"$f":"IF(F166=0,\"Variabel pris\",IFERROR((HLOOKUP(F166,'Variable priser'!$C$6:$H$16,2)+(F166-HLOOKUP(F166,'Variable priser'!$C$6:$H$16,1))*HLOOKUP(F166,'Variable priser'!$C$6:$H$16,3))/F166*'Variable priser'!$K$7*(1+Genanskaffelsespriser!$D$203),\"Fejl\"))","v":"Variabel pris"},{"$f":"IF(ISBLANK(E166),\"\",IF(E166=0,\"\",IF(ISNUMBER(E166),((J166*E166)/C166)*N166,\"\")))","v":""},{"$f":"IF(ISBLANK(F166),\"\",IF(F166=0,\"\",IF(ISNUMBER(F166),((K166*F166)/C166)*N166,\"\")))","v":""},1,1]
["Beluftningsanlæg, iltningstrappe, Mek./EL","m³/h ",{"$f":"Genanskaffelsespriser!$E$31","v":25},0,0,0,0,0,null,{"$f":"IF(E167=0,\"Variabel pris\",IFERROR((HLOOKUP(E167,'Variable priser'!$C$6:$H$16,2)+(E167-HLOOKUP(E167,'Variable priser'!$C$6:$H$16,1))*HLOOKUP(E167,'Variable priser'!$C$6:$H$16,3))/E167*'Variable priser'!$L$7*(1+Genanskaffelsespriser!$D$203),\"Fejl\"))","v":"Variabel pris"},{"$f":"IF(F167=0,\"Variabel pris\",IFERROR((HLOOKUP(F167,'Variable priser'!$C$6:$H$16,2)+(F167-HLOOKUP(F167,'Variable priser'!$C$6:$H$16,1))*HLOOKUP(F167,'Variable priser'!$C$6:$H$16,3))/F167*'Variable priser'!$L$7*(1+Genanskaffelsespriser!$D$203),\"Fejl\"))","v":"Variabel pris"},{"$f":"IF(ISBLANK(E167),\"\",IF(E167=0,\"\",IF(ISNUMBER(E167),((J167*E167)/C167)*N167,\"\")))","v":""},{"$f":"IF(ISBLANK(F167),\"\",IF(F167=0,\"\",IF(ISNUMBER(F167),((K167*F167)/C167)*N167,\"\")))","v":""},1,1]
["Beluftningsanlæg, ika-beluftning, Konstruktioner","m³/h ",{"$f":"Genanskaffelsespriser!$E$32","v":50},0,0,0,0,0,null,{"$f":"IF(E168=0,\"Variabel pris\",IFERROR((HLOOKUP(E168,'Variable priser'!$C$6:$H$16,4)+(E168-HLOOKUP(E168,'Variable priser'!$C$6:$H$16,1))*HLOOKUP(E168,'Variable priser'!$C$6:$H$16,5))/E168*'Variable priser'!$K$9*(1+Genanskaffelsespriser!$D$203),\"Fejl\"))","v":"Variabel pris"},{"$f":"IF(F168=0,\"Variabel pris\",IFERROR((HLOOKUP(F168,'Variable priser'!$C$6:$H$16,4)+(F168-HLOOKUP(F168,'Variable priser'!$C$6:$H$16,1))*HLOOKUP(F168,'Variable priser'!$C$6:$H$16,5))/F168*'Variable priser'!$K$9*(1+Genanskaffelsespriser!$D$203),\"Fejl\"))","v":"Variabel pris"},"","",1,1]
["Beluftningsanlæg, ika-beluftning, Mek./EL","m³/h ",{"$f":"Genanskaffelsespriser!$E$33","v":25},0,0,0,0,0,null,{"$f":"IF(E169=0,\"Variabel pris\",IFERROR((HLOOKUP(E169,'Variable priser'!$C$6:$H$16,4)+(E169-HLOOKUP(E169,'Variable priser'!$C$6:$H$16,1))*HLOOKUP(E169,'Variable priser'!$C$6:$H$16,5))/E169*'Variable priser'!$L$9*(1+Genanskaffelsespriser!$D$203),\"Fejl\"))","v":"Variabel pris"},{"$f":"IF(F169=0,\"Variabel pris\",IFERROR((HLOOKUP(F169,'Variable priser'!$C$6:$H$16,4)+(F169-HLOOKUP(F169,'Variable priser'!$C$6:$H$16,1))*HLOOKUP(F169,'Variable priser'!$C$6:$H$16,5))/F169*'Variable priser'!$L$9*(1+Genanskaffelsespriser!$D$203),\"Fejl\"))","v":"Variabel pris"},"","",1,1]
["Beluftningsanlæg, bundbeluftbning, Konstruktioner","m³/h ",{"$f":"Genanskaffelsespriser!$E$34","v":50},85,85,85,0,0,null,{"$f":"IF(E170=0,\"Variabel pris\",IFERROR((HLOOKUP(E170,'Variable priser'!$C$6:$H$16,6)+(E170-HLOOKUP(E170,'Variable priser'!$C$6:$H$16,1))*HLOOKUP(E170,'Variable priser'!$C$6:$H$16,7))/E170*'Variable priser'!$K$17*(1+Genanskaffelsespriser!$D$203),\"Fejl\"))","v":2977.2802266479989},{"$f":"IF(F170=0,\"Variabel pris\",IFERROR((HLOOKUP(F170,'Variable priser'!$C$6:$H$16,6)+(F170-HLOOKUP(F170,'Variable priser'!$C$6:$H$16,1))*HLOOKUP(F170,'Variable priser'!$C$6:$H$16,7))/F170*'Variable priser'!$K$17*(1+Genanskaffelsespriser!$D$203),\"Fejl\"))","v":2977.2802266479989},5061.376385301598,5061.376385301598,1,1]
["Beluftningsanlæg, bundbeluftbning, Mek./EL","m³/h ",{"$f":"Genanskaffelsespriser!$E$35","v":25},85,85,85,0,0,null,{"$f":"IF(E171=0,\"Variabel pris\",IFERROR((HLOOKUP(E171,'Variable priser'!$C$6:$H$16,6)+(E171-HLOOKUP(E171,'Variable priser'!$C$6:$H$16,1))*HLOOKUP(E171,'Variable priser'!$C$6:$H$16,7))/E171*'Variable priser'!$L$17*(1+Genanskaffelsespriser!$D$203),\"Fejl\"))","v":1275.9772399919996},{"$f":"IF(F171=0,\"Variabel pris\",IFERROR((HLOOKUP(F171,'Variable priser'!$C$6:$H$16,6)+(F171-HLOOKUP(F171,'Variable priser'!$C$6:$H$16,1))*HLOOKUP(F171,'Variable priser'!$C$6:$H$16,7))/F171*'Variable priser'!$L$17*(1+Genanskaffelsespriser!$D$203),\"Fejl\"))","v":1275.9772399919996},4338.3226159727983,4338.3226159727983,1,1]
["Beluftningsanlæg, rislebakke, Konstruktioner","m³/h ",{"$f":"Genanskaffelsespriser!$E$36","v":50},0,0,0,0,0,null,{"$f":"IF(E172=0,\"Variabel pris\",IFERROR((HLOOKUP(E172,'Variable priser'!$C$6:$H$18,12)+(E172-HLOOKUP(E172,'Variable priser'!$C$6:$H$18,1))*HLOOKUP(E172,'Variable priser'!$C$6:$H$18,13))/E172*'Variable priser'!$K$17*(1+Genanskaffelsespriser!$D$203),\"Fejl\"))","v":"Variabel pris"},{"$f":"IF(F172=0,\"Variabel pris\",IFERROR((HLOOKUP(F172,'Variable priser'!$C$6:$H$18,12)+(F172-HLOOKUP(F172,'Variable priser'!$C$6:$H$18,1))*HLOOKUP(F172,'Variable priser'!$C$6:$H$18,13))/F172*'Variable priser'!$K$17*(1+Genanskaffelsespriser!$D$203),\"Fejl\"))","v":"Variabel pris"},"","",1,1]
["Beluftningsanlæg, rislebakke, Mek./EL","m³/h ",{"$f":"Genanskaffelsespriser!$E$37","v":25},0,0,0,0,0,null,{"$f":"IF(E173=0,\"Variabel pris\",IFERROR((HLOOKUP(E173,'Variable priser'!$C$6:$H$18,12)+(E173-HLOOKUP(E173,'Variable priser'!$C$6:$H$18,1))*HLOOKUP(E173,'Variable priser'!$C$6:$H$18,13))/E173*'Variable priser'!$L$17*(1+Genanskaffelsespriser!$D$203),\"Fejl\"))","v":"Variabel pris"},{"$f":"IF(F173=0,\"Variabel pris\",IFERROR((HLOOKUP(F173,'Variable priser'!$C$6:$H$18,12)+(F173-HLOOKUP(F173,'Variable priser'!$C$6:$H$18,1))*HLOOKUP(F173,'Variable priser'!$C$6:$H$18,13))/F173*'Variable priser'!$L$17*(1+Genanskaffelsespriser!$D$203),\"Fejl\"))","v":"Variabel pris"},"","",1,1]
["Beluftningsanlæg, kompressorbeluftning","m³/h ",{"$f":"Genanskaffelsespriser!$E$38","v":25},0,0,0,0,0,null,{"$f":"IF(E174=0,\"Variabel pris\",IFERROR((HLOOKUP(E174,'Variable priser'!$C$6:$H$16,8)+(E174-HLOOKUP(E174,'Variable priser'!$C$6:$H$16,1))*HLOOKUP(E174,'Variable priser'!$C$6:$H$16,9))/E174*(1+Genanskaffelsespriser!$D$203),\"Fejl\"))","v":"Variabel pris"},{"$f":"IF(F174=0,\"Variabel pris\",IFERROR((HLOOKUP(F174,'Variable priser'!$C$6:$H$16,8)+(F174-HLOOKUP(F174,'Variable priser'!$C$6:$H$16,1))*HLOOKUP(F174,'Variable priser'!$C$6:$H$16,9))/F174*(1+Genanskaffelsespriser!$D$203),\"Fejl\"))","v":"Variabel pris"},"","",1,1]
["Beluftningsanlæg, ren ilt","m³/h ",{"$f":"Genanskaffelsespriser!$E$39","v":25},0,0,0,0,0,null,{"$f":"IF(E175=0,\"Variabel pris\",IFERROR((HLOOKUP(E175,'Variable priser'!$C$6:$H$16,10)+(E175-HLOOKUP(E175,'Variable priser'!$C$6:$H$16,1))*HLOOKUP(E175,'Variable priser'!$C$6:$H$16,11))/E175*(1+Genanskaffelsespriser!$D$203),\"Fejl\"))","v":"Variabel pris"},{"$f":"IF(F175=0,\"Variabel pris\",IFERROR((HLOOKUP(F175,'Variable priser'!$C$6:$H$16,10)+(F175-HLOOKUP(F175,'Variable priser'!$C$6:$H$16,1))*HLOOKUP(F175,'Variable priser'!$C$6:$H$16,11))/F175*(1+Genanskaffelsespriser!$D$203),\"Fejl\"))","v":"Variabel pris"},"","",1,1]
["Behandlingsanlæg, kalk anlæg","m³/h ",{"$f":"Genanskaffelsespriser!$E$40","v":25},0,0,0,0,0,null,{"$f":"IF(E176=0,\"Variabel pris\",IFERROR((HLOOKUP(E176,'Variable priser'!$C$20:$G$24,3)+(E176-HLOOKUP(E176,'Variable priser'!$C$20:$G$24,1))*HLOOKUP(E176,'Variable priser'!$C$20:$G$24,4))/E176*(1+Genanskaffelsespriser!$D$203),\"Fejl\"))","v":"Variabel pris"},{"$f":"IF(F176=0,\"Variabel pris\",IFERROR((HLOOKUP(F176,'Variable priser'!$C$20:$G$24,3)+(F176-HLOOKUP(F176,'Variable priser'!$C$20:$G$24,1))*HLOOKUP(F176,'Variable priser'!$C$20:$G$24,4))/F176*(1+Genanskaffelsespriser!$D$203),\"Fejl\"))","v":"Variabel pris"},"","",1,1]
["Behandlingsanlæg, luddosering","m³/h ",{"$f":"Genanskaffelsespriser!$E$41","v":25},0,0,0,0,0,null,{"$f":"IF(E177=0,\"Variabel pris\",IFERROR((HLOOKUP(E177,'Variable priser'!$C$20:$G$25,5)+(E177-HLOOKUP(E177,'Variable priser'!$C$20:$G$25,1))*HLOOKUP(E177,'Variable priser'!$C$20:$G$25,6))/E177*(1+Genanskaffelsespriser!$D$203),\"Fejl\"))","v":"Variabel pris"},{"$f":"IF(F177=0,\"Variabel pris\",IFERROR((HLOOKUP(F177,'Variable priser'!$C$20:$G$25,5)+(F177-HLOOKUP(F177,'Variable priser'!$C$20:$G$25,1))*HLOOKUP(F177,'Variable priser'!$C$20:$G$25,6))/F177*(1+Genanskaffelsespriser!$D$203),\"Fejl\"))","v":"Variabel pris"},"","",1,1]
["Filteranlæg, åbne filtre, enkelt filtrering, Konstruktioner","m³/h ",{"$f":"Genanskaffelsespriser!$E$42","v":50},0,0,0,0,0,null,{"$f":"IF(E178=0,\"Variabel pris\",IFERROR((HLOOKUP(E178,'Variable priser'!$C$28:$G$38,9)+(E178-HLOOKUP(E178,'Variable priser'!$C$28:$G$38,1))*HLOOKUP(E178,'Variable priser'!$C$28:$G$38,10))/E178*'Variable priser'!$K$31*(1+Genanskaffelsespriser!$D$203),\"Fejl\"))","v":"Variabel pris"},{"$f":"IF(F178=0,\"Variabel pris\",IFERROR((HLOOKUP(F178,'Variable priser'!$C$28:$G$38,9)+(F178-HLOOKUP(F178,'Variable priser'!$C$28:$G$38,1))*HLOOKUP(F178,'Variable priser'!$C$28:$G$38,10))/F178*'Variable priser'!$K$31*(1+Genanskaffelsespriser!$D$203),\"Fejl\"))","v":"Variabel pris"},"","",1,1]
["Filteranlæg, åbne filtre, enkelt filtrering, Mek./EL","m³/h ",{"$f":"Genanskaffelsespriser!$E$43","v":25},0,0,0,0,0,null,{"$f":"IF(E179=0,\"Variabel pris\",IFERROR((HLOOKUP(E179,'Variable priser'!$C$28:$G$38,9)+(E179-HLOOKUP(E179,'Variable priser'!$C$28:$G$38,1))*HLOOKUP(E179,'Variable priser'!$C$28:$G$38,10))/E179*'Variable priser'!$L$31*(1+Genanskaffelsespriser!$D$203),\"Fejl\"))","v":"Variabel pris"},{"$f":"IF(F179=0,\"Variabel pris\",IFERROR((HLOOKUP(F179,'Variable priser'!$C$28:$G$38,9)+(F179-HLOOKUP(F179,'Variable priser'!$C$28:$G$38,1))*HLOOKUP(F179,'Variable priser'!$C$28:$G$38,10))/F179*'Variable priser'!$L$31*(1+Genanskaffelsespriser!$D$203),\"Fejl\"))","v":"Variabel pris"},"","",1,1]
["Filteranlæg, åbne filtre, dobbelt filtrering, Konstruktioner","m³/h ",{"$f":"Genanskaffelsespriser!$E$44","v":50},85,85,85,0,0,null,{"$f":"IF(E180=0,\"Variabel pris\",IFERROR((HLOOKUP(E180,'Variable priser'!$C$28:$G$38,6)+(E180-HLOOKUP(E180,'Variable priser'!$C$28:$G$38,1))*HLOOKUP(E180,'Variable priser'!$C$28:$G$38,7))/E180*'Variable priser'!$K$31*(1+Genanskaffelsespriser!$D$203),\"Fejl\"))","v":11279.808197280001},{"$f":"IF(F180=0,\"Variabel pris\",IFERROR((HLOOKUP(F180,'Variable priser'!$C$28:$G$38,6)+(F180-HLOOKUP(F180,'Variable priser'!$C$28:$G$38,1))*HLOOKUP(F180,'Variable priser'!$C$28:$G$38,7))/F180*'Variable priser'!$K$31*(1+Genanskaffelsespriser!$D$203),\"Fejl\"))","v":11279.808197280001},19175.673935376002,19175.673935376002,1,1]
["Filteranlæg, åbne filtre, dobbelt filtrering, Mek./EL","m³/h ",{"$f":"Genanskaffelsespriser!$E$45","v":25},85,85,85,0,0,null,{"$f":"IF(E181=0,\"Variabel pris\",IFERROR((HLOOKUP(E181,'Variable priser'!$C$28:$G$38,6)+(E181-HLOOKUP(E181,'Variable priser'!$C$28:$G$38,1))*HLOOKUP(E181,'Variable priser'!$C$28:$G$38,7))/E181*'Variable priser'!$L$31*(1+Genanskaffelsespriser!$D$203),\"Fejl\"))","v":16919.712295919999},{"$f":"IF(F181=0,\"Variabel pris\",IFERROR((HLOOKUP(F181,'Variable priser'!$C$28:$G$38,6)+(F181-HLOOKUP(F181,'Variable priser'!$C$28:$G$38,1))*HLOOKUP(F181,'Variable priser'!$C$28:$G$38,7))/F181*'Variable priser'!$L$31*(1+Genanskaffelsespriser!$D$203),\"Fejl\"))","v":16919.712295919999},57527.021806127996,57527.021806127996,1,1]
["Filteranlæg, trykfiltre, enkelt filtrering","m³/h ",{"$f":"Genanskaffelsespriser!$E$46","v":25},0,0,0,0,0,null,{"$f":"IF(E182=0,\"Variabel pris\",IFERROR((HLOOKUP(E182,'Variable priser'!$C$40:$H$42,2)+(E182-HLOOKUP(E182,'Variable priser'!$C$40:$H$42,1))*HLOOKUP(E182,'Variable priser'!$C$40:$H$42,3))/E182*(1+Genanskaffelsespriser!$D$203),\"Fejl\"))","v":"Variabel pris"},{"$f":"IF(F182=0,\"Variabel pris\",IFERROR((HLOOKUP(F182,'Variable priser'!$C$40:$H$42,2)+(F182-HLOOKUP(F182,'Variable priser'!$C$40:$H$42,1))*HLOOKUP(F182,'Variable priser'!$C$40:$H$42,3))/F182*(1+Genanskaffelsespriser!$D$203),\"Fejl\"))","v":"Variabel pris"},"","",1,1]
["Filteranlæg, trykfiltre, dobbelt filtrering","m³/h ",{"$f":"Genanskaffelsespriser!$E$47","v":25},0,0,0,0,0,null,{"$f":"IF(E183=0,\"Variabel pris\",IFERROR((HLOOKUP(E183,'Variable priser'!$C$44:$H$46,2)+(E183-HLOOKUP(E183,'Variable priser'!$C$44:$H$46,1))*HLOOKUP(E183,'Variable priser'!$C$44:$H$46,3))/E183*(1+Genanskaffelsespriser!$D$203),\"Fejl\"))","v":"Variabel pris"},{"$f":"IF(F183=0,\"Variabel pris\",IFERROR((HLOOKUP(F183,'Variable priser'!$C$44:$H$46,2)+(F183-HLOOKUP(F183,'Variable priser'!$C$44:$H$46,1))*HLOOKUP(F183,'Variable priser'!$C$44:$H$46,3))/F183*(1+Genanskaffelsespriser!$D$203),\"Fejl\"))","v":"Variabel pris"},"","",1,1]
["Rentvandsbeholder  insitu støbt","m³",{"$f":"Genanskaffelsespriser!$E$48","v":50},500,500,500,0,0,null,{"$f":"IF(E184=0,\"Variabel pris\",IFERROR((HLOOKUP(E184,'Variable priser'!$C$48:$H$50,2)+(E184-HLOOKUP(E184,'Variable priser'!$C$48:$H$50,1))*HLOOKUP(E184,'Variable priser'!$C$48:$H$50,3))/E184*(1+Genanskaffelsespriser!$D$203),\"Fejl\"))","v":4860.2232144},{"$f":"IF(F184=0,\"Variabel pris\",IFERROR((HLOOKUP(F184,'Variable priser'!$C$48:$H$50,2)+(F184-HLOOKUP(F184,'Variable priser'!$C$48:$H$50,1))*HLOOKUP(F184,'Variable priser'!$C$48:$H$50,3))/F184*(1+Genanskaffelsespriser!$D$203),\"Fejl\"))","v":4860.2232144},48602.232144000001,48602.232144000001,1,1]
["Rentvandsbeholder  element","m³",{"$f":"Genanskaffelsespriser!$E$49","v":50},0,0,0,0,0,null,{"$f":"IF(E185=0,\"Variabel pris\",IFERROR((HLOOKUP(E185,'Variable priser'!$C$52:$H$54,2)+(E185-HLOOKUP(E185,'Variable priser'!$C$52:$H$54,1))*HLOOKUP(E185,'Variable priser'!$C$52:$H$54,3))/E185*(1+Genanskaffelsespriser!$D$203),\"Fejl\"))","v":"Variabel pris"},{"$f":"IF(F185=0,\"Variabel pris\",IFERROR((HLOOKUP(F185,'Variable priser'!$C$52:$H$54,2)+(F185-HLOOKUP(F185,'Variable priser'!$C$52:$H$54,1))*HLOOKUP(F185,'Variable priser'!$C$52:$H$54,3))/F185*(1+Genanskaffelsespriser!$D$203),\"Fejl\"))","v":"Variabel pris"},"","",1,1]
["Udpumpningsanlæg, rentvandspumper på vandværk","m³/h ",{"$f":"Genanskaffelsespriser!$E$50","v":25},180,180,180,0,0,null,{"$f":"IF(E186=0,\"Variabel pris\",IFERROR((HLOOKUP(E186,'Variable priser'!$C$71:$H$73,2)+(E186-HLOOKUP(E186,'Variable priser'!$C$71:$H$73,1))*HLOOKUP(E186,'Variable priser'!$C$71:$H$73,3))/E186*(1+Genanskaffelsespriser!$D$203),\"Fejl\"))","v":1247.7164796296297},{"$f":"IF(F186=0,\"Variabel pris\",IFERROR((HLOOKUP(F186,'Variable priser'!$C$71:$H$73,2)+(F186-HLOOKUP(F186,'Variable priser'!$C$71:$H$73,1))*HLOOKUP(F186,'Variable priser'!$C$71:$H$73,3))/F186*(1+Genanskaffelsespriser!$D$203),\"Fejl\"))","v":1247.7164796296297},8983.5586533333335,8983.5586533333335,1,1]
["Udpumpningsanlæg, frekvensomformer","kW",{"$f":"Genanskaffelsespriser!$E$51","v":25},15,15,15,0,0,null,{"$f":"IF(E187=0,\"Variabel pris\",IFERROR((HLOOKUP(E187,'Variable priser'!$C$76:$J$78,2)+(E187-HLOOKUP(E187,'Variable priser'!$C$76:$J$78,1))*HLOOKUP(E187,'Variable priser'!$C$76:$J$78,3))/E187*(1+Genanskaffelsespriser!$D$203),\"Fejl\"))","v":6482.3201840000029},{"$f":"IF(F187=0,\"Variabel pris\",IFERROR((HLOOKUP(F187,'Variable priser'!$C$76:$J$78,2)+(F187-HLOOKUP(F187,'Variable priser'!$C$76:$J$78,1))*HLOOKUP(F187,'Variable priser'!$C$76:$J$78,3))/F187*(1+Genanskaffelsespriser!$D$203),\"Fejl\"))","v":6482.3201840000029},3889.3921104000019,3889.3921104000019,1,1]
["Udpumpningsanlæg, Hydrofor","liter",{"$f":"Genanskaffelsespriser!$E$52","v":25},0,0,0,0,0,null,{"$f":"IF(E188=0,\"Variabel pris\",IFERROR((HLOOKUP(E188,'Variable priser'!$C$81:$J$83,2)+(E188-HLOOKUP(E188,'Variable priser'!$C$81:$J$83,1))*HLOOKUP(E188,'Variable priser'!$C$81:$J$83,3))/E188*(1+Genanskaffelsespriser!$D$203),\"Fejl\"))","v":"Variabel pris"},{"$f":"IF(F188=0,\"Variabel pris\",IFERROR((HLOOKUP(F188,'Variable priser'!$C$81:$J$83,2)+(F188-HLOOKUP(F188,'Variable priser'!$C$81:$J$83,1))*HLOOKUP(F188,'Variable priser'!$C$81:$J$83,3))/F188*(1+Genanskaffelsespriser!$D$203),\"Fejl\"))","v":"Variabel pris"},"","",1,1]
["Skyllevand-/slamhåndteringsanlæg - lukkede betonbeholdere","m³",{"$f":"Genanskaffelsespriser!$E$53","v":50},20,20,20,0,0,null,{"$f":"IF(E189=0,\"Variabel pris\",IFERROR((HLOOKUP(E189,'Variable priser'!$C$59:$H$61,2)+(E189-HLOOKUP(E189,'Variable priser'!$C$59:$H$61,1))*HLOOKUP(E189,'Variable priser'!$C$59:$H$61,3))/E189*(1+Genanskaffelsespriser!$D$203),\"Fejl\"))","v":5400.2480159999986},{"$f":"IF(F189=0,\"Variabel pris\",IFERROR((HLOOKUP(F189,'Variable priser'!$C$59:$H$61,2)+(F189-HLOOKUP(F189,'Variable priser'!$C$59:$H$61,1))*HLOOKUP(F189,'Variable priser'!$C$59:$H$61,3))/F189*(1+Genanskaffelsespriser!$D$203),\"Fejl\"))","v":5400.2480159999986},2160.0992063999993,2160.0992063999993,1,1]
["Skyllevand-/slamhåndteringsanl. - åbne med faste sider/bund","m³",{"$f":"Genanskaffelsespriser!$E$54","v":50},0,0,0,0,0,null,{"$f":"IF(E190=0,\"Variabel pris\",IFERROR((HLOOKUP(E190,'Variable priser'!$C$59:$H$64,5)+(E190-HLOOKUP(E190,'Variable priser'!$C$59:$H$64,1))*HLOOKUP(E190,'Variable priser'!$C$59:$H$64,6))/E190*(1+Genanskaffelsespriser!$D$203),\"Fejl\"))","v":"Variabel pris"},{"$f":"IF(F190=0,\"Variabel pris\",IFERROR((HLOOKUP(F190,'Variable priser'!$C$59:$H$64,5)+(F190-HLOOKUP(F190,'Variable priser'!$C$59:$H$64,1))*HLOOKUP(F190,'Variable priser'!$C$59:$H$64,6))/F190*(1+Genanskaffelsespriser!$D$203),\"Fejl\"))","v":"Variabel pris"},"","",1,1]
["Skyllevand-/slamhåndteringsanlæg - jordbassiner","m³",{"$f":"Genanskaffelsespriser!$E$55","v":50},0,0,0,0,0,null,{"$f":"IF(E191=0,\"Variabel pris\",IFERROR((HLOOKUP(E191,'Variable priser'!$C$59:$H$67,8)+(E191-HLOOKUP(E191,'Variable priser'!$C$59:$H$67,1))*HLOOKUP(E191,'Variable priser'!$C$59:$H$67,9))/E191*(1+Genanskaffelsespriser!$D$203),\"Fejl\"))","v":"Variabel pris"},{"$f":"IF(F191=0,\"Variabel pris\",IFERROR((HLOOKUP(F191,'Variable priser'!$C$59:$H$67,8)+(F191-HLOOKUP(F191,'Variable priser'!$C$59:$H$67,1))*HLOOKUP(F191,'Variable priser'!$C$59:$H$67,9))/F191*(1+Genanskaffelsespriser!$D$203),\"Fejl\"))","v":"Variabel pris"},"","",1,1]
["Skyllevandsbehandling, inkl. UV-filter mv., Mek./EL","m³/h.",{"$f":"Genanskaffelsespriser!$E$56","v":25},3,3,3,0,0,null,{"$f":"IF(E192=0,\"Variabel pris\",IFERROR((HLOOKUP(E192,'Variable priser'!$C$108:$E$110,2)+(E192-HLOOKUP(E192,'Variable priser'!$C$108:$E$110,1))*HLOOKUP(E192,'Variable priser'!$C$108:$E$110,3))/E192*'Variable priser'!$H$109*(1+Genanskaffelsespriser!$D$203),\"Fejl\"))","v":22725.411682499995},{"$f":"IF(F192=0,\"Variabel pris\",IFERROR((HLOOKUP(F192,'Variable priser'!$C$108:$E$110,2)+(F192-HLOOKUP(F192,'Variable priser'!$C$108:$E$110,1))*HLOOKUP(F192,'Variable priser'!$C$108:$E$110,3))/F192*'Variable priser'!$H$109*(1+Genanskaffelsespriser!$D$203),\"Fejl\"))","v":22725.411682499995},2727.0494018999993,2727.0494018999993,1,1]
["Skyllevandsbehandling, inkl. UV-filter mv., SRO","m³/h.",{"$f":"Genanskaffelsespriser!$E$57","v":10},3,3,3,0,0,null,{"$f":"IF(E193=0,\"Variabel pris\",IFERROR((HLOOKUP(E193,'Variable priser'!$C$108:$E$110,2)+(E193-HLOOKUP(E193,'Variable priser'!$C$108:$E$110,1))*HLOOKUP(E193,'Variable priser'!$C$108:$E$110,3))/E193*'Variable priser'!$I$109*(1+Genanskaffelsespriser!$D$203),\"Fejl\"))","v":4010.3667674999988},{"$f":"IF(F193=0,\"Variabel pris\",IFERROR((HLOOKUP(F193,'Variable priser'!$C$108:$E$110,2)+(F193-HLOOKUP(F193,'Variable priser'!$C$108:$E$110,1))*HLOOKUP(F193,'Variable priser'!$C$108:$E$110,3))/F193*'Variable priser'!$I$109*(1+Genanskaffelsespriser!$D$203),\"Fejl\"))","v":4010.3667674999988},1203.1100302499995,1203.1100302499995,1,1]
["Nødstrømsanlæg på vandværk","kW",{"$f":"Genanskaffelsespriser!$E$58","v":25},0,0,0,0,0,null,{"$f":"IF(E194=0,\"Variabel pris\",IFERROR((HLOOKUP(E194,'Variable priser'!$C$86:$H$88,2)+(E194-HLOOKUP(E194,'Variable priser'!$C$86:$H$88,1))*HLOOKUP(E194,'Variable priser'!$C$86:$H$88,3))/E194*(1+Genanskaffelsespriser!$D$203),\"Fejl\"))","v":"Variabel pris"},{"$f":"IF(F194=0,\"Variabel pris\",IFERROR((HLOOKUP(F194,'Variable priser'!$C$86:$H$88,2)+(F194-HLOOKUP(F194,'Variable priser'!$C$86:$H$88,1))*HLOOKUP(F194,'Variable priser'!$C$86:$H$88,3))/F194*(1+Genanskaffelsespriser!$D$203),\"Fejl\"))","v":"Variabel pris"},"","",1,1]
["Elanlæg og SRO-anlæg - vandværk, Elanlæg","m³/h.",{"$f":"Genanskaffelsespriser!$E$59","v":25},85,85,85,0,0,null,{"$f":"IF(E195=0,\"Variabel pris\",IFERROR((HLOOKUP(E195,'Variable priser'!$C$91:$J$95,4)+(E195-HLOOKUP(E195,'Variable priser'!$C$91:$J$95,1))*HLOOKUP(E195,'Variable priser'!$C$91:$J$95,5))/E195*(1+Genanskaffelsespriser!$D$203),\"Fejl\"))","v":5452.0018799999998},{"$f":"IF(F195=0,\"Variabel pris\",IFERROR((HLOOKUP(F195,'Variable priser'!$C$91:$J$95,4)+(F195-HLOOKUP(F195,'Variable priser'!$C$91:$J$95,1))*HLOOKUP(F195,'Variable priser'!$C$91:$J$95,5))/F195*(1+Genanskaffelsespriser!$D$203),\"Fejl\"))","v":5452.0018799999998},18536.806391999999,18536.806391999999,1,1]
["Elanlæg og SRO-anlæg - vandværk, SRO","m³/h.",{"$f":"Genanskaffelsespriser!$E$60","v":10},85,85,85,0,0,null,{"$f":"IF(E196=0,\"Variabel pris\",IFERROR((HLOOKUP(E196,'Variable priser'!$C$91:$J$98,7)+(E196-HLOOKUP(E196,'Variable priser'!$C$91:$J$98,1))*HLOOKUP(E196,'Variable priser'!$C$91:$J$98,8))/E196*(1+Genanskaffelsespriser!$D$203),\"Fejl\"))","v":3735.7961599999999},{"$f":"IF(F196=0,\"Variabel pris\",IFERROR((HLOOKUP(F196,'Variable priser'!$C$91:$J$98,7)+(F196-HLOOKUP(F196,'Variable priser'!$C$91:$J$98,1))*HLOOKUP(F196,'Variable priser'!$C$91:$J$98,8))/F196*(1+Genanskaffelsespriser!$D$203),\"Fejl\"))","v":3735.7961599999999},31754.267359999998,31754.267359999998,1,1]
["Vandværk 6"]
["Beluftningsanlæg, iltningstrappe, Konstruktioner","m³/h ",{"$f":"Genanskaffelsespriser!$E$30","v":50},0,null,null,{"$f":"IF($D198=\"\",IF($E198>0,\"Ny data\",IF($E198=\"\",\"\",0)),IF($D198=0,IF($E198=0,0,\"Ny data\"),($E198-$D198)/$D198))","v":0},{"$f":"IF($E198=\"\",IF($F198>0,\"Ny data\",IF($F198=\"\",\"\",0)),IF($E198=0,IF($F198=0,0,\"Ny data\"),($F198-$E198)/$E198))","v":""},null,{"$f":"IF(E198=0,\"Variabel pris\",IFERROR((HLOOKUP(E198,'Variable priser'!$C$6:$H$16,2)+(E198-HLOOKUP(E198,'Variable priser'!$C$6:$H$16,1))*HLOOKUP(E198,'Variable priser'!$C$6:$H$16,3))/E198*'Variable priser'!$K$7*(1+Genanskaffelsespriser!$D$203),\"Fejl\"))","v":"Variabel pris"},{"$f":"IF(F198=0,\"Variabel pris\",IFERROR((HLOOKUP(F198,'Variable priser'!$C$6:$H$16,2)+(F198-HLOOKUP(F198,'Variable priser'!$C$6:$H$16,1))*HLOOKUP(F198,'Variable priser'!$C$6:$H$16,3))/F198*'Variable priser'!$K$7*(1+Genanskaffelsespriser!$D$203),\"Fejl\"))","v":"Variabel pris"},{"$f":"IF(ISBLANK(E198),\"\",IF(E198=0,\"\",IF(ISNUMBER(E198),((J198*E198)/C198)*N198,\"\")))","v":""},{"$f":"IF(ISBLANK(F198),\"\",IF(F198=0,\"\",IF(ISNUMBER(F198),((K198*F198)/C198)*N198,\"\")))","v":""},1,1]
["Beluftningsanlæg, iltningstrappe, Mek./EL","m³/h ",{"$f":"Genanskaffelsespriser!$E$31","v":25},0,null,null,0,"",null,{"$f":"IF(E199=0,\"Variabel pris\",IFERROR((HLOOKUP(E199,'Variable priser'!$C$6:$H$16,2)+(E199-HLOOKUP(E199,'Variable priser'!$C$6:$H$16,1))*HLOOKUP(E199,'Variable priser'!$C$6:$H$16,3))/E199*'Variable priser'!$L$7*(1+Genanskaffelsespriser!$D$203),\"Fejl\"))","v":"Variabel pris"},{"$f":"IF(F199=0,\"Variabel pris\",IFERROR((HLOOKUP(F199,'Variable priser'!$C$6:$H$16,2)+(F199-HLOOKUP(F199,'Variable priser'!$C$6:$H$16,1))*HLOOKUP(F199,'Variable priser'!$C$6:$H$16,3))/F199*'Variable priser'!$L$7*(1+Genanskaffelsespriser!$D$203),\"Fejl\"))","v":"Variabel pris"},{"$f":"IF(ISBLANK(E199),\"\",IF(E199=0,\"\",IF(ISNUMBER(E199),((J199*E199)/C199)*N199,\"\")))","v":""},{"$f":"IF(ISBLANK(F199),\"\",IF(F199=0,\"\",IF(ISNUMBER(F199),((K199*F199)/C199)*N199,\"\")))","v":""},1,1]
["Beluftningsanlæg, ika-beluftning, Konstruktioner","m³/h ",{"$f":"Genanskaffelsespriser!$E$32","v":50},0,null,null,0,"",null,{"$f":"IF(E200=0,\"Variabel pris\",IFERROR((HLOOKUP(E200,'Variable priser'!$C$6:$H$16,4)+(E200-HLOOKUP(E200,'Variable priser'!$C$6:$H$16,1))*HLOOKUP(E200,'Variable priser'!$C$6:$H$16,5))/E200*'Variable priser'!$K$9*(1+Genanskaffelsespriser!$D$203),\"Fejl\"))","v":"Variabel pris"},{"$f":"IF(F200=0,\"Variabel pris\",IFERROR((HLOOKUP(F200,'Variable priser'!$C$6:$H$16,4)+(F200-HLOOKUP(F200,'Variable priser'!$C$6:$H$16,1))*HLOOKUP(F200,'Variable priser'!$C$6:$H$16,5))/F200*'Variable priser'!$K$9*(1+Genanskaffelsespriser!$D$203),\"Fejl\"))","v":"Variabel pris"},"","",1,1]
["Beluftningsanlæg, ika-beluftning, Mek./EL","m³/h ",{"$f":"Genanskaffelsespriser!$E$33","v":25},0,null,null,0,"",null,{"$f":"IF(E201=0,\"Variabel pris\",IFERROR((HLOOKUP(E201,'Variable priser'!$C$6:$H$16,4)+(E201-HLOOKUP(E201,'Variable priser'!$C$6:$H$16,1))*HLOOKUP(E201,'Variable priser'!$C$6:$H$16,5))/E201*'Variable priser'!$L$9*(1+Genanskaffelsespriser!$D$203),\"Fejl\"))","v":"Variabel pris"},{"$f":"IF(F201=0,\"Variabel pris\",IFERROR((HLOOKUP(F201,'Variable priser'!$C$6:$H$16,4)+(F201-HLOOKUP(F201,'Variable priser'!$C$6:$H$16,1))*HLOOKUP(F201,'Variable priser'!$C$6:$H$16,5))/F201*'Variable priser'!$L$9*(1+Genanskaffelsespriser!$D$203),\"Fejl\"))","v":"Variabel pris"},"","",1,1]
["Beluftningsanlæg, bundbeluftbning, Konstruktioner","m³/h ",{"$f":"Genanskaffelsespriser!$E$34","v":50},0,null,null,0,"",null,{"$f":"IF(E202=0,\"Variabel pris\",IFERROR((HLOOKUP(E202,'Variable priser'!$C$6:$H$16,6)+(E202-HLOOKUP(E202,'Variable priser'!$C$6:$H$16,1))*HLOOKUP(E202,'Variable priser'!$C$6:$H$16,7))/E202*'Variable priser'!$K$17*(1+Genanskaffelsespriser!$D$203),\"Fejl\"))","v":"Variabel pris"},{"$f":"IF(F202=0,\"Variabel pris\",IFERROR((HLOOKUP(F202,'Variable priser'!$C$6:$H$16,6)+(F202-HLOOKUP(F202,'Variable priser'!$C$6:$H$16,1))*HLOOKUP(F202,'Variable priser'!$C$6:$H$16,7))/F202*'Variable priser'!$K$17*(1+Genanskaffelsespriser!$D$203),\"Fejl\"))","v":"Variabel pris"},"","",1,1]
["Beluftningsanlæg, bundbeluftbning, Mek./EL","m³/h ",{"$f":"Genanskaffelsespriser!$E$35","v":25},0,null,null,0,"",null,{"$f":"IF(E203=0,\"Variabel pris\",IFERROR((HLOOKUP(E203,'Variable priser'!$C$6:$H$16,6)+(E203-HLOOKUP(E203,'Variable priser'!$C$6:$H$16,1))*HLOOKUP(E203,'Variable priser'!$C$6:$H$16,7))/E203*'Variable priser'!$L$17*(1+Genanskaffelsespriser!$D$203),\"Fejl\"))","v":"Variabel pris"},{"$f":"IF(F203=0,\"Variabel pris\",IFERROR((HLOOKUP(F203,'Variable priser'!$C$6:$H$16,6)+(F203-HLOOKUP(F203,'Variable priser'!$C$6:$H$16,1))*HLOOKUP(F203,'Variable priser'!$C$6:$H$16,7))/F203*'Variable priser'!$L$17*(1+Genanskaffelsespriser!$D$203),\"Fejl\"))","v":"Variabel pris"},"","",1,1]
["Beluftningsanlæg, rislebakke, Konstruktioner","m³/h ",{"$f":"Genanskaffelsespriser!$E$36","v":50},0,null,null,0,"",null,{"$f":"IF(E204=0,\"Variabel pris\",IFERROR((HLOOKUP(E204,'Variable priser'!$C$6:$H$18,12)+(E204-HLOOKUP(E204,'Variable priser'!$C$6:$H$18,1))*HLOOKUP(E204,'Variable priser'!$C$6:$H$18,13))/E204*'Variable priser'!$K$17*(1+Genanskaffelsespriser!$D$203),\"Fejl\"))","v":"Variabel pris"},{"$f":"IF(F204=0,\"Variabel pris\",IFERROR((HLOOKUP(F204,'Variable priser'!$C$6:$H$18,12)+(F204-HLOOKUP(F204,'Variable priser'!$C$6:$H$18,1))*HLOOKUP(F204,'Variable priser'!$C$6:$H$18,13))/F204*'Variable priser'!$K$17*(1+Genanskaffelsespriser!$D$203),\"Fejl\"))","v":"Variabel pris"},"","",1,1]
["Beluftningsanlæg, rislebakke, Mek./EL","m³/h ",{"$f":"Genanskaffelsespriser!$E$37","v":25},0,null,null,0,"",null,{"$f":"IF(E205=0,\"Variabel pris\",IFERROR((HLOOKUP(E205,'Variable priser'!$C$6:$H$18,12)+(E205-HLOOKUP(E205,'Variable priser'!$C$6:$H$18,1))*HLOOKUP(E205,'Variable priser'!$C$6:$H$18,13))/E205*'Variable priser'!$L$17*(1+Genanskaffelsespriser!$D$203),\"Fejl\"))","v":"Variabel pris"},{"$f":"IF(F205=0,\"Variabel pris\",IFERROR((HLOOKUP(F205,'Variable priser'!$C$6:$H$18,12)+(F205-HLOOKUP(F205,'Variable priser'!$C$6:$H$18,1))*HLOOKUP(F205,'Variable priser'!$C$6:$H$18,13))/F205*'Variable priser'!$L$17*(1+Genanskaffelsespriser!$D$203),\"Fejl\"))","v":"Variabel pris"},"","",1,1]
["Beluftningsanlæg, kompressorbeluftning","m³/h ",{"$f":"Genanskaffelsespriser!$E$38","v":25},0,null,null,0,"",null,{"$f":"IF(E206=0,\"Variabel pris\",IFERROR((HLOOKUP(E206,'Variable priser'!$C$6:$H$16,8)+(E206-HLOOKUP(E206,'Variable priser'!$C$6:$H$16,1))*HLOOKUP(E206,'Variable priser'!$C$6:$H$16,9))/E206*(1+Genanskaffelsespriser!$D$203),\"Fejl\"))","v":"Variabel pris"},{"$f":"IF(F206=0,\"Variabel pris\",IFERROR((HLOOKUP(F206,'Variable priser'!$C$6:$H$16,8)+(F206-HLOOKUP(F206,'Variable priser'!$C$6:$H$16,1))*HLOOKUP(F206,'Variable priser'!$C$6:$H$16,9))/F206*(1+Genanskaffelsespriser!$D$203),\"Fejl\"))","v":"Variabel pris"},"","",1,1]
["Beluftningsanlæg, ren ilt","m³/h ",{"$f":"Genanskaffelsespriser!$E$39","v":25},0,null,null,0,"",null,{"$f":"IF(E207=0,\"Variabel pris\",IFERROR((HLOOKUP(E207,'Variable priser'!$C$6:$H$16,10)+(E207-HLOOKUP(E207,'Variable priser'!$C$6:$H$16,1))*HLOOKUP(E207,'Variable priser'!$C$6:$H$16,11))/E207*(1+Genanskaffelsespriser!$D$203),\"Fejl\"))","v":"Variabel pris"},{"$f":"IF(F207=0,\"Variabel pris\",IFERROR((HLOOKUP(F207,'Variable priser'!$C$6:$H$16,10)+(F207-HLOOKUP(F207,'Variable priser'!$C$6:$H$16,1))*HLOOKUP(F207,'Variable priser'!$C$6:$H$16,11))/F207*(1+Genanskaffelsespriser!$D$203),\"Fejl\"))","v":"Variabel pris"},"","",1,1]
["Behandlingsanlæg, kalk anlæg","m³/h ",{"$f":"Genanskaffelsespriser!$E$40","v":25},0,null,null,0,"",null,{"$f":"IF(E208=0,\"Variabel pris\",IFERROR((HLOOKUP(E208,'Variable priser'!$C$20:$G$24,3)+(E208-HLOOKUP(E208,'Variable priser'!$C$20:$G$24,1))*HLOOKUP(E208,'Variable priser'!$C$20:$G$24,4))/E208*(1+Genanskaffelsespriser!$D$203),\"Fejl\"))","v":"Variabel pris"},{"$f":"IF(F208=0,\"Variabel pris\",IFERROR((HLOOKUP(F208,'Variable priser'!$C$20:$G$24,3)+(F208-HLOOKUP(F208,'Variable priser'!$C$20:$G$24,1))*HLOOKUP(F208,'Variable priser'!$C$20:$G$24,4))/F208*(1+Genanskaffelsespriser!$D$203),\"Fejl\"))","v":"Variabel pris"},"","",1,1]
["Behandlingsanlæg, luddosering","m³/h ",{"$f":"Genanskaffelsespriser!$E$41","v":25},0,null,null,0,"",null,{"$f":"IF(E209=0,\"Variabel pris\",IFERROR((HLOOKUP(E209,'Variable priser'!$C$20:$G$25,5)+(E209-HLOOKUP(E209,'Variable priser'!$C$20:$G$25,1))*HLOOKUP(E209,'Variable priser'!$C$20:$G$25,6))/E209*(1+Genanskaffelsespriser!$D$203),\"Fejl\"))","v":"Variabel pris"},{"$f":"IF(F209=0,\"Variabel pris\",IFERROR((HLOOKUP(F209,'Variable priser'!$C$20:$G$25,5)+(F209-HLOOKUP(F209,'Variable priser'!$C$20:$G$25,1))*HLOOKUP(F209,'Variable priser'!$C$20:$G$25,6))/F209*(1+Genanskaffelsespriser!$D$203),\"Fejl\"))","v":"Variabel pris"},"","",1,1]
["Filteranlæg, åbne filtre, enkelt filtrering, Konstruktioner","m³/h ",{"$f":"Genanskaffelsespriser!$E$42","v":50},0,null,null,0,"",null,{"$f":"IF(E210=0,\"Variabel pris\",IFERROR((HLOOKUP(E210,'Variable priser'!$C$28:$G$38,9)+(E210-HLOOKUP(E210,'Variable priser'!$C$28:$G$38,1))*HLOOKUP(E210,'Variable priser'!$C$28:$G$38,10))/E210*'Variable priser'!$K$31*(1+Genanskaffelsespriser!$D$203),\"Fejl\"))","v":"Variabel pris"},{"$f":"IF(F210=0,\"Variabel pris\",IFERROR((HLOOKUP(F210,'Variable priser'!$C$28:$G$38,9)+(F210-HLOOKUP(F210,'Variable priser'!$C$28:$G$38,1))*HLOOKUP(F210,'Variable priser'!$C$28:$G$38,10))/F210*'Variable priser'!$K$31*(1+Genanskaffelsespriser!$D$203),\"Fejl\"))","v":"Variabel pris"},"","",1,1]
["Filteranlæg, åbne filtre, enkelt filtrering, Mek./EL","m³/h ",{"$f":"Genanskaffelsespriser!$E$43","v":25},0,null,null,0,"",null,{"$f":"IF(E211=0,\"Variabel pris\",IFERROR((HLOOKUP(E211,'Variable priser'!$C$28:$G$38,9)+(E211-HLOOKUP(E211,'Variable priser'!$C$28:$G$38,1))*HLOOKUP(E211,'Variable priser'!$C$28:$G$38,10))/E211*'Variable priser'!$L$31*(1+Genanskaffelsespriser!$D$203),\"Fejl\"))","v":"Variabel pris"},{"$f":"IF(F211=0,\"Variabel pris\",IFERROR((HLOOKUP(F211,'Variable priser'!$C$28:$G$38,9)+(F211-HLOOKUP(F211,'Variable priser'!$C$28:$G$38,1))*HLOOKUP(F211,'Variable priser'!$C$28:$G$38,10))/F211*'Variable priser'!$L$31*(1+Genanskaffelsespriser!$D$203),\"Fejl\"))","v":"Variabel pris"},"","",1,1]
["Filteranlæg, åbne filtre, dobbelt filtrering, Konstruktioner","m³/h ",{"$f":"Genanskaffelsespriser!$E$44","v":50},0,null,null,0,"",null,{"$f":"IF(E212=0,\"Variabel pris\",IFERROR((HLOOKUP(E212,'Variable priser'!$C$28:$G$38,6)+(E212-HLOOKUP(E212,'Variable priser'!$C$28:$G$38,1))*HLOOKUP(E212,'Variable priser'!$C$28:$G$38,7))/E212*'Variable priser'!$K$31*(1+Genanskaffelsespriser!$D$203),\"Fejl\"))","v":"Variabel pris"},{"$f":"IF(F212=0,\"Variabel pris\",IFERROR((HLOOKUP(F212,'Variable priser'!$C$28:$G$38,6)+(F212-HLOOKUP(F212,'Variable priser'!$C$28:$G$38,1))*HLOOKUP(F212,'Variable priser'!$C$28:$G$38,7))/F212*'Variable priser'!$K$31*(1+Genanskaffelsespriser!$D$203),\"Fejl\"))","v":"Variabel pris"},"","",1,1]
["Filteranlæg, åbne filtre, dobbelt filtrering, Mek./EL","m³/h ",{"$f":"Genanskaffelsespriser!$E$45","v":25},0,null,null,0,"",null,{"$f":"IF(E213=0,\"Variabel pris\",IFERROR((HLOOKUP(E213,'Variable priser'!$C$28:$G$38,6)+(E213-HLOOKUP(E213,'Variable priser'!$C$28:$G$38,1))*HLOOKUP(E213,'Variable priser'!$C$28:$G$38,7))/E213*'Variable priser'!$L$31*(1+Genanskaffelsespriser!$D$203),\"Fejl\"))","v":"Variabel pris"},{"$f":"IF(F213=0,\"Variabel pris\",IFERROR((HLOOKUP(F213,'Variable priser'!$C$28:$G$38,6)+(F213-HLOOKUP(F213,'Variable priser'!$C$28:$G$38,1))*HLOOKUP(F213,'Variable priser'!$C$28:$G$38,7))/F213*'Variable priser'!$L$31*(1+Genanskaffelsespriser!$D$203),\"Fejl\"))","v":"Variabel pris"},"","",1,1]
["Filteranlæg, trykfiltre, enkelt filtrering","m³/h ",{"$f":"Genanskaffelsespriser!$E$46","v":25},0,null,null,0,"",null,{"$f":"IF(E214=0,\"Variabel pris\",IFERROR((HLOOKUP(E214,'Variable priser'!$C$40:$H$42,2)+(E214-HLOOKUP(E214,'Variable priser'!$C$40:$H$42,1))*HLOOKUP(E214,'Variable priser'!$C$40:$H$42,3))/E214*(1+Genanskaffelsespriser!$D$203),\"Fejl\"))","v":"Variabel pris"},{"$f":"IF(F214=0,\"Variabel pris\",IFERROR((HLOOKUP(F214,'Variable priser'!$C$40:$H$42,2)+(F214-HLOOKUP(F214,'Variable priser'!$C$40:$H$42,1))*HLOOKUP(F214,'Variable priser'!$C$40:$H$42,3))/F214*(1+Genanskaffelsespriser!$D$203),\"Fejl\"))","v":"Variabel pris"},"","",1,1]
["Filteranlæg, trykfiltre, dobbelt filtrering","m³/h ",{"$f":"Genanskaffelsespriser!$E$47","v":25},0,null,null,0,"",null,{"$f":"IF(E215=0,\"Variabel pris\",IFERROR((HLOOKUP(E215,'Variable priser'!$C$44:$H$46,2)+(E215-HLOOKUP(E215,'Variable priser'!$C$44:$H$46,1))*HLOOKUP(E215,'Variable priser'!$C$44:$H$46,3))/E215*(1+Genanskaffelsespriser!$D$203),\"Fejl\"))","v":"Variabel pris"},{"$f":"IF(F215=0,\"Variabel pris\",IFERROR((HLOOKUP(F215,'Variable priser'!$C$44:$H$46,2)+(F215-HLOOKUP(F215,'Variable priser'!$C$44:$H$46,1))*HLOOKUP(F215,'Variable priser'!$C$44:$H$46,3))/F215*(1+Genanskaffelsespriser!$D$203),\"Fejl\"))","v":"Variabel pris"},"","",1,1]
["Rentvandsbeholder  insitu støbt","m³",{"$f":"Genanskaffelsespriser!$E$48","v":50},0,null,null,0,"",null,{"$f":"IF(E216=0,\"Variabel pris\",IFERROR((HLOOKUP(E216,'Variable priser'!$C$48:$H$50,2)+(E216-HLOOKUP(E216,'Variable priser'!$C$48:$H$50,1))*HLOOKUP(E216,'Variable priser'!$C$48:$H$50,3))/E216*(1+Genanskaffelsespriser!$D$203),\"Fejl\"))","v":"Variabel pris"},{"$f":"IF(F216=0,\"Variabel pris\",IFERROR((HLOOKUP(F216,'Variable priser'!$C$48:$H$50,2)+(F216-HLOOKUP(F216,'Variable priser'!$C$48:$H$50,1))*HLOOKUP(F216,'Variable priser'!$C$48:$H$50,3))/F216*(1+Genanskaffelsespriser!$D$203),\"Fejl\"))","v":"Variabel pris"},"","",1,1]
["Rentvandsbeholder  element","m³",{"$f":"Genanskaffelsespriser!$E$49","v":50},0,null,null,0,"",null,{"$f":"IF(E217=0,\"Variabel pris\",IFERROR((HLOOKUP(E217,'Variable priser'!$C$52:$H$54,2)+(E217-HLOOKUP(E217,'Variable priser'!$C$52:$H$54,1))*HLOOKUP(E217,'Variable priser'!$C$52:$H$54,3))/E217*(1+Genanskaffelsespriser!$D$203),\"Fejl\"))","v":"Variabel pris"},{"$f":"IF(F217=0,\"Variabel pris\",IFERROR((HLOOKUP(F217,'Variable priser'!$C$52:$H$54,2)+(F217-HLOOKUP(F217,'Variable priser'!$C$52:$H$54,1))*HLOOKUP(F217,'Variable priser'!$C$52:$H$54,3))/F217*(1+Genanskaffelsespriser!$D$203),\"Fejl\"))","v":"Variabel pris"},"","",1,1]
["Udpumpningsanlæg, rentvandspumper på vandværk","m³/h ",{"$f":"Genanskaffelsespriser!$E$50","v":25},0,null,null,0,"",null,{"$f":"IF(E218=0,\"Variabel pris\",IFERROR((HLOOKUP(E218,'Variable priser'!$C$71:$H$73,2)+(E218-HLOOKUP(E218,'Variable priser'!$C$71:$H$73,1))*HLOOKUP(E218,'Variable priser'!$C$71:$H$73,3))/E218*(1+Genanskaffelsespriser!$D$203),\"Fejl\"))","v":"Variabel pris"},{"$f":"IF(F218=0,\"Variabel pris\",IFERROR((HLOOKUP(F218,'Variable priser'!$C$71:$H$73,2)+(F218-HLOOKUP(F218,'Variable priser'!$C$71:$H$73,1))*HLOOKUP(F218,'Variable priser'!$C$71:$H$73,3))/F218*(1+Genanskaffelsespriser!$D$203),\"Fejl\"))","v":"Variabel pris"},"","",1,1]
["Udpumpningsanlæg, frekvensomformer","kW",{"$f":"Genanskaffelsespriser!$E$51","v":25},0,null,null,0,"",null,{"$f":"IF(E219=0,\"Variabel pris\",IFERROR((HLOOKUP(E219,'Variable priser'!$C$76:$J$78,2)+(E219-HLOOKUP(E219,'Variable priser'!$C$76:$J$78,1))*HLOOKUP(E219,'Variable priser'!$C$76:$J$78,3))/E219*(1+Genanskaffelsespriser!$D$203),\"Fejl\"))","v":"Variabel pris"},{"$f":"IF(F219=0,\"Variabel pris\",IFERROR((HLOOKUP(F219,'Variable priser'!$C$76:$J$78,2)+(F219-HLOOKUP(F219,'Variable priser'!$C$76:$J$78,1))*HLOOKUP(F219,'Variable priser'!$C$76:$J$78,3))/F219*(1+Genanskaffelsespriser!$D$203),\"Fejl\"))","v":"Variabel pris"},"","",1,1]
["Udpumpningsanlæg, Hydrofor","liter",{"$f":"Genanskaffelsespriser!$E$52","v":25},0,null,null,0,"",null,{"$f":"IF(E220=0,\"Variabel pris\",IFERROR((HLOOKUP(E220,'Variable priser'!$C$81:$J$83,2)+(E220-HLOOKUP(E220,'Variable priser'!$C$81:$J$83,1))*HLOOKUP(E220,'Variable priser'!$C$81:$J$83,3))/E220*(1+Genanskaffelsespriser!$D$203),\"Fejl\"))","v":"Variabel pris"},{"$f":"IF(F220=0,\"Variabel pris\",IFERROR((HLOOKUP(F220,'Variable priser'!$C$81:$J$83,2)+(F220-HLOOKUP(F220,'Variable priser'!$C$81:$J$83,1))*HLOOKUP(F220,'Variable priser'!$C$81:$J$83,3))/F220*(1+Genanskaffelsespriser!$D$203),\"Fejl\"))","v":"Variabel pris"},"","",1,1]
["Skyllevand-/slamhåndteringsanlæg - lukkede betonbeholdere","m³",{"$f":"Genanskaffelsespriser!$E$53","v":50},0,null,null,0,"",null,{"$f":"IF(E221=0,\"Variabel pris\",IFERROR((HLOOKUP(E221,'Variable priser'!$C$59:$H$61,2)+(E221-HLOOKUP(E221,'Variable priser'!$C$59:$H$61,1))*HLOOKUP(E221,'Variable priser'!$C$59:$H$61,3))/E221*(1+Genanskaffelsespriser!$D$203),\"Fejl\"))","v":"Variabel pris"},{"$f":"IF(F221=0,\"Variabel pris\",IFERROR((HLOOKUP(F221,'Variable priser'!$C$59:$H$61,2)+(F221-HLOOKUP(F221,'Variable priser'!$C$59:$H$61,1))*HLOOKUP(F221,'Variable priser'!$C$59:$H$61,3))/F221*(1+Genanskaffelsespriser!$D$203),\"Fejl\"))","v":"Variabel pris"},"","",1,1]
["Skyllevand-/slamhåndteringsanl. - åbne med faste sider/bund","m³",{"$f":"Genanskaffelsespriser!$E$54","v":50},0,null,null,0,"",null,{"$f":"IF(E222=0,\"Variabel pris\",IFERROR((HLOOKUP(E222,'Variable priser'!$C$59:$H$64,5)+(E222-HLOOKUP(E222,'Variable priser'!$C$59:$H$64,1))*HLOOKUP(E222,'Variable priser'!$C$59:$H$64,6))/E222*(1+Genanskaffelsespriser!$D$203),\"Fejl\"))","v":"Variabel pris"},{"$f":"IF(F222=0,\"Variabel pris\",IFERROR((HLOOKUP(F222,'Variable priser'!$C$59:$H$64,5)+(F222-HLOOKUP(F222,'Variable priser'!$C$59:$H$64,1))*HLOOKUP(F222,'Variable priser'!$C$59:$H$64,6))/F222*(1+Genanskaffelsespriser!$D$203),\"Fejl\"))","v":"Variabel pris"},"","",1,1]
["Skyllevand-/slamhåndteringsanlæg - jordbassiner","m³",{"$f":"Genanskaffelsespriser!$E$55","v":50},0,null,null,0,"",null,{"$f":"IF(E223=0,\"Variabel pris\",IFERROR((HLOOKUP(E223,'Variable priser'!$C$59:$H$67,8)+(E223-HLOOKUP(E223,'Variable priser'!$C$59:$H$67,1))*HLOOKUP(E223,'Variable priser'!$C$59:$H$67,9))/E223*(1+Genanskaffelsespriser!$D$203),\"Fejl\"))","v":"Variabel pris"},{"$f":"IF(F223=0,\"Variabel pris\",IFERROR((HLOOKUP(F223,'Variable priser'!$C$59:$H$67,8)+(F223-HLOOKUP(F223,'Variable priser'!$C$59:$H$67,1))*HLOOKUP(F223,'Variable priser'!$C$59:$H$67,9))/F223*(1+Genanskaffelsespriser!$D$203),\"Fejl\"))","v":"Variabel pris"},"","",1,1]
["Skyllevandsbehandling, inkl. UV-filter mv., Mek./EL","m³/h.",{"$f":"Genanskaffelsespriser!$E$56","v":25},0,null,null,0,"",null,{"$f":"IF(E224=0,\"Variabel pris\",IFERROR((HLOOKUP(E224,'Variable priser'!$C$108:$E$110,2)+(E224-HLOOKUP(E224,'Variable priser'!$C$108:$E$110,1))*HLOOKUP(E224,'Variable priser'!$C$108:$E$110,3))/E224*'Variable priser'!$H$109*(1+Genanskaffelsespriser!$D$203),\"Fejl\"))","v":"Variabel pris"},{"$f":"IF(F224=0,\"Variabel pris\",IFERROR((HLOOKUP(F224,'Variable priser'!$C$108:$E$110,2)+(F224-HLOOKUP(F224,'Variable priser'!$C$108:$E$110,1))*HLOOKUP(F224,'Variable priser'!$C$108:$E$110,3))/F224*'Variable priser'!$H$109*(1+Genanskaffelsespriser!$D$203),\"Fejl\"))","v":"Variabel pris"},"","",1,1]
["Skyllevandsbehandling, inkl. UV-filter mv., SRO","m³/h.",{"$f":"Genanskaffelsespriser!$E$57","v":10},0,null,null,0,"",null,{"$f":"IF(E225=0,\"Variabel pris\",IFERROR((HLOOKUP(E225,'Variable priser'!$C$108:$E$110,2)+(E225-HLOOKUP(E225,'Variable priser'!$C$108:$E$110,1))*HLOOKUP(E225,'Variable priser'!$C$108:$E$110,3))/E225*'Variable priser'!$I$109*(1+Genanskaffelsespriser!$D$203),\"Fejl\"))","v":"Variabel pris"},{"$f":"IF(F225=0,\"Variabel pris\",IFERROR((HLOOKUP(F225,'Variable priser'!$C$108:$E$110,2)+(F225-HLOOKUP(F225,'Variable priser'!$C$108:$E$110,1))*HLOOKUP(F225,'Variable priser'!$C$108:$E$110,3))/F225*'Variable priser'!$I$109*(1+Genanskaffelsespriser!$D$203),\"Fejl\"))","v":"Variabel pris"},"","",1,1]
["Nødstrømsanlæg på vandværk","kW",{"$f":"Genanskaffelsespriser!$E$58","v":25},0,null,null,0,"",null,{"$f":"IF(E226=0,\"Variabel pris\",IFERROR((HLOOKUP(E226,'Variable priser'!$C$86:$H$88,2)+(E226-HLOOKUP(E226,'Variable priser'!$C$86:$H$88,1))*HLOOKUP(E226,'Variable priser'!$C$86:$H$88,3))/E226*(1+Genanskaffelsespriser!$D$203),\"Fejl\"))","v":"Variabel pris"},{"$f":"IF(F226=0,\"Variabel pris\",IFERROR((HLOOKUP(F226,'Variable priser'!$C$86:$H$88,2)+(F226-HLOOKUP(F226,'Variable priser'!$C$86:$H$88,1))*HLOOKUP(F226,'Variable priser'!$C$86:$H$88,3))/F226*(1+Genanskaffelsespriser!$D$203),\"Fejl\"))","v":"Variabel pris"},"","",1,1]
["Elanlæg og SRO-anlæg - vandværk, Elanlæg","m³/h.",{"$f":"Genanskaffelsespriser!$E$59","v":25},0,null,null,0,"",null,{"$f":"IF(E227=0,\"Variabel pris\",IFERROR((HLOOKUP(E227,'Variable priser'!$C$91:$J$95,4)+(E227-HLOOKUP(E227,'Variable priser'!$C$91:$J$95,1))*HLOOKUP(E227,'Variable priser'!$C$91:$J$95,5))/E227*(1+Genanskaffelsespriser!$D$203),\"Fejl\"))","v":"Variabel pris"},{"$f":"IF(F227=0,\"Variabel pris\",IFERROR((HLOOKUP(F227,'Variable priser'!$C$91:$J$95,4)+(F227-HLOOKUP(F227,'Variable priser'!$C$91:$J$95,1))*HLOOKUP(F227,'Variable priser'!$C$91:$J$95,5))/F227*(1+Genanskaffelsespriser!$D$203),\"Fejl\"))","v":"Variabel pris"},"","",1,1]
["Elanlæg og SRO-anlæg - vandværk, SRO","m³/h.",{"$f":"Genanskaffelsespriser!$E$60","v":10},0,null,null,0,"",null,{"$f":"IF(E228=0,\"Variabel pris\",IFERROR((HLOOKUP(E228,'Variable priser'!$C$91:$J$98,7)+(E228-HLOOKUP(E228,'Variable priser'!$C$91:$J$98,1))*HLOOKUP(E228,'Variable priser'!$C$91:$J$98,8))/E228*(1+Genanskaffelsespriser!$D$203),\"Fejl\"))","v":"Variabel pris"},{"$f":"IF(F228=0,\"Variabel pris\",IFERROR((HLOOKUP(F228,'Variable priser'!$C$91:$J$98,7)+(F228-HLOOKUP(F228,'Variable priser'!$C$91:$J$98,1))*HLOOKUP(F228,'Variable priser'!$C$91:$J$98,8))/F228*(1+Genanskaffelsespriser!$D$203),\"Fejl\"))","v":"Variabel pris"},"","",1,1]
["Bygninger"]
["Etageareal vandbehandlingsbygning","m²",{"$f":"Genanskaffelsespriser!E62","v":75},1445,1445,1445,0,{"$f":"IF($E230=\"\",IF($F230>0,\"Ny data\",IF($F230=\"\",\"\",0)),IF($E230=0,IF($F230=0,0,\"Ny data\"),($F230-$E230)/$E230))","v":0},null,{"$f":"Genanskaffelsespriser!$D62","v":18777.995999999999},{"$f":"J230","v":18777.995999999999},{"$f":"IF(ISNUMBER(E230),((J230*E230)/C230)*N230,\"\")","v":361789.38959999999},{"$f":"IF(ISNUMBER(F230),((K230*F230)/C230)*O230,\"\")","v":361789.38959999999},1,1]
["Etageareal kontor og mandskabsfaciliteter","m²",{"$f":"Genanskaffelsespriser!E63","v":75},362.51,484.33500000000009,484.33500000000009,0.33605969490496845,0,"Udvidelse af hovedkontor",{"$f":"Genanskaffelsespriser!$D63","v":20023.432999999997},{"$f":"J231","v":20023.432999999997},129307.3256274,129307.3256274,1,1]
["Værksted","m²",{"$f":"Genanskaffelsespriser!E64","v":75},null,0,null,0,0,null,{"$f":"Genanskaffelsespriser!$D64","v":15473.076999999999},15473.076999999999,0,"",1,1]
["Lager","m²",{"$f":"Genanskaffelsespriser!E65","v":75},151,151,151,0,0,null,{"$f":"Genanskaffelsespriser!$D65","v":15473.076999999999},15473.076999999999,31152.461693333331,31152.461693333331,1,1]
["Garage og rørlager","m²",{"$f":"Genanskaffelsespriser!E66","v":75},null,0,0,0,0,null,{"$f":"Genanskaffelsespriser!$D66","v":10830.428},10830.428,0,0,1,1]
["Bygning for trykforøgere","m²",{"$f":"Genanskaffelsespriser!E67","v":75},137,137,137,0,0,null,{"$f":"Genanskaffelsespriser!$D67","v":21069.766},21069.766,38487.439226666662,38487.439226666662,1,1]
["Laboratorium (bygning, inkl. inventar+udstyr), Konstruktioner","m²",{"$f":"Genanskaffelsespriser!E68","v":75},163,163,163,0,0,null,{"$f":"Genanskaffelsespriser!$D68","v":21115.393999999997},21115.393999999997,45890.789626666665,45890.789626666665,1,1]
["Laboratorium (bygning, inkl. inventar+udstyr), Mek./EL","m²",{"$f":"Genanskaffelsespriser!E69","v":10},163,163,163,0,0,null,{"$f":"Genanskaffelsespriser!$D69","v":14077.275},14077.275,229459.58249999996,229459.58249999996,1,1]
["Andre"]
["Sikring (terror, hærværk), Mek./EL","stk.",{"$f":"Genanskaffelsespriser!E71","v":25},0,null,null,0,"",null,{"$f":"Genanskaffelsespriser!$D71","v":6607.7639999999992},{"$f":"J239","v":6607.7639999999992},"","",1,1]
["Sikring (terror, hærværk), SRO","stk.",{"$f":"Genanskaffelsespriser!E72","v":10},0,null,null,0,"",null,{"$f":"Genanskaffelsespriser!$D72","v":15418.115999999998},{"$f":"J240","v":15418.115999999998},"","",1,1]
["Sikring, mindre avanceret (hegn, porte), Mek./EL","stk.",{"$f":"Genanskaffelsespriser!E73","v":25},0,null,null,0,"",null,{"$f":"Genanskaffelsespriser!$D73","v":27031.478999999999},27031.478999999999,"","",1,1]
["Sikring, mindre avanceret (hegn, porte), SRO","stk.",{"$f":"Genanskaffelsespriser!E74","v":10},0,null,null,0,"",null,{"$f":"Genanskaffelsespriser!$D74","v":63073.450999999994},63073.450999999994,"","",1,1]
["Sikring, avanceret (hegn, porte og overvågningssystemer), Mek./EL","stk.",{"$f":"Genanskaffelsespriser!E75","v":25},8,8,8,0,0,null,{"$f":"Genanskaffelsespriser!$D75","v":58401.765999999996},58401.765999999996,18688.565119999999,18688.565119999999,1,1]
["Sikring, avanceret (hegn, porte og overvågningssystemer), SRO","stk.",{"$f":"Genanskaffelsespriser!E76","v":10},8,8,8,0,0,null,{"$f":"Genanskaffelsespriser!$D76","v":233606.02699999997},233606.02699999997,186884.82159999997,186884.82159999997,1,1]

{"sheet":"Distributionsanlæg","index":1,"n_rows":116,"n_cols":15,"rows_kept":116,"cut":false,"hidden":false,"merged":[],"read":"row_number_cap"}
["Distributionsanlæg","Enhed","Standard-levetid","Samlet mængde per 31/12-2023","Samlet mængde per 31/12-2024","Samlet mængde per 31/12-2025","Afvigelse \n2023-2024","Afvigelse\n2024-2025","Bemærkninger","Enhedspris\n2024","Enhedspris\n2025","Netvolumenbidrag\n2024","Netvolumenbidrag\n2025","Ejerandel\n2024 (%)","Ejerandel\n2025 (%)"]
["Ledningsnet - Land",null,null,null,null,null,null,null,null,null,null,null,null,1]
["Ledningsnet ≤ Ø50 mm","meter",{"$f":"Genanskaffelsespriser!E81","v":75},5072.0683529811922,3590.4862603937468,3598.8569714458918,{"$f":"IF($D3=\"\",IF($E3>0,\"Ny data\",IF($E3=\"\",\"\",0)),IF($D3=0,IF($E3=0,0,\"Ny data\"),($E3-$D3)/$D3))","v":-0.29210609744969646},{"$f":"IF($E3=\"\",IF($F3>0,\"Ny data\",IF($F3=\"\",\"\",0)),IF($E3=0,IF($F3=0,0,\"Ny data\"),($F3-$E3)/$E3))","v":2.3313586085766092E-3},"Nedlagt dobbeltstræk",{"$f":"Genanskaffelsespriser!$D81","v":548.57299999999998},{"$f":"J3","v":548.57299999999998},{"$f":"IF(ISNUMBER(E3),((J3*E3)/C3)*N3,\"\")","v":26261.917590973051},{"$f":"IF(ISNUMBER(F3),((K3*F3)/C3)*O3,\"\")","v":26323.143538626493},1,1]
["Ø 50mm < Ledningsnet ≤ Ø110 mm","meter",{"$f":"Genanskaffelsespriser!E82","v":75},16082.245170036174,18619.426290104104,19832.028679943774,{"$f":"IF($D4=\"\",IF($E4>0,\"Ny data\",IF($E4=\"\",\"\",0)),IF($D4=0,IF($E4=0,0,\"Ny data\"),($E4-$D4)/$D4))","v":0.15776286788582905},{"$f":"IF($E4=\"\",IF($F4>0,\"Ny data\",IF($F4=\"\",\"\",0)),IF($E4=0,IF($F4=0,0,\"Ny data\"),($F4-$E4)/$E4))","v":6.512565805983761E-2},null,{"$f":"Genanskaffelsespriser!$D82","v":837.89599999999996},{"$f":"J4","v":837.89599999999996},{"$f":"IF(ISNUMBER(E4),((J4*E4)/C4)*N4,\"\")","v":208015.23747697423},{"$f":"IF(ISNUMBER(F4),((K4*F4)/C4)*O4,\"\")","v":221562.36670413555},1,1]
["Ø110 mm < Ledningsnet ≤ Ø 250 mm","meter",{"$f":"Genanskaffelsespriser!E83","v":75},7615.0356661083806,7679.0312248318878,7660.6175851618718,8.4038422838026913E-3,-2.3979118108637589E-3,null,{"$f":"Genanskaffelsespriser!$D83","v":1568.981},1568.981,160643.38786890614,160258.17919179812,1,1]
["Ø 250 mm < Ledningsnet ≤ Ø 500mm","meter",{"$f":"Genanskaffelsespriser!E84","v":75},5390.3096510458772,5390.3096510458927,5262.0556635651819,2.8683713795810997E-15,-2.3793435958883245E-2,null,{"$f":"Genanskaffelsespriser!$D84","v":3052.9279999999999},3052.9279999999999,219416.36349797648,214195.6943047563,1,1]
["Ledningsnet > Ø 500 mm","meter",{"$f":"Genanskaffelsespriser!E85","v":75},0,0,0,0,0,null,{"$f":"Genanskaffelsespriser!$D85","v":5963.7869999999994},5963.7869999999994,0,0,1,1]
["Støbejernsledninger ≤ Ø50 mm","meter",{"$f":"Genanskaffelsespriser!E86","v":100},82.525261228629603,83,82.242273722874003,5.75264790807716E-3,-9.1292322545300803E-3,null,{"$f":"Genanskaffelsespriser!$D86","v":932.26299999999992},932.26299999999992,773.77828999999997,766.71428827707689,1,1]
["Støbejernsledninger Ø 50mm < Ledningsnet ≤ Ø110 mm","meter",{"$f":"Genanskaffelsespriser!E87","v":100},1367.6791804114778,1182.2090206091957,1363.6392905182147,-0.1356094049384314,0.15346716760419191,null,{"$f":"Genanskaffelsespriser!$D87","v":1091.961},1091.961,12909.261443534378,14890.409233135602,1,1]
["Støbejernsledninger Ø110 mm < Ledningsnet ≤ Ø 250 mm","meter",{"$f":"Genanskaffelsespriser!E88","v":100},623.14925163023395,623.14925163023645,621.35447479149798,4.013661933047893E-15,-2.8801716989037703E-3,null,{"$f":"Genanskaffelsespriser!$D88","v":1545.1299999999999},1545.1299999999999,9628.4660317142716,9600.7343963458716,1,1]
["Støbejernsledninger Ø 250 mm < Ledningsnet ≤ Ø 500mm","meter",{"$f":"Genanskaffelsespriser!E89","v":100},0,0,0,0,0,null,{"$f":"Genanskaffelsespriser!$D89","v":2864.194},2864.194,0,0,1,1]
["Støbejernsledninger Ledningsnet > Ø 500 mm","meter",{"$f":"Genanskaffelsespriser!E90","v":100},0,0,0,0,0,null,{"$f":"Genanskaffelsespriser!$D90","v":5686.9079999999994},5686.9079999999994,0,0,1,1]
["Eternitledninger ≤ Ø50 mm","meter",{"$f":"Genanskaffelsespriser!E91","v":75},0,0,0,0,0,null,{"$f":"Genanskaffelsespriser!$D91","v":679.2349999999999},679.2349999999999,0,0,1,1]
["Eternitledninger Ø 50mm < Ledningsnet ≤ Ø110 mm","meter",{"$f":"Genanskaffelsespriser!E92","v":75},0,0,0,0,0,null,{"$f":"Genanskaffelsespriser!$D92","v":917.74499999999989},917.74499999999989,0,0,1,1]
["Eternitledninger Ø110 mm < Ledningsnet ≤ Ø 250 mm","meter",{"$f":"Genanskaffelsespriser!E93","v":75},2922.3886153742092,2922.3320783330255,2916.2045469527311,-1.9346174867449772E-5,-2.0967950308336241E-3,null,{"$f":"Genanskaffelsespriser!$D93","v":1334.6189999999999},1334.6189999999999,52002.665547369914,51893.626616660091,1,1]
["Eternitledninger Ø 250 mm < Ledningsnet ≤ Ø 500mm","meter",{"$f":"Genanskaffelsespriser!E94","v":75},598.76013556708699,598.76013556708256,597.95616910565593,-7.4049463345514415E-15,-1.3427187510825071E-3,null,{"$f":"Genanskaffelsespriser!$D94","v":3169.0719999999997},3169.0719999999997,25300.186404557935,25266.215369866655,1,1]
["Eternitledninger Ledningsnet > Ø 500 mm","meter",{"$f":"Genanskaffelsespriser!E95","v":75},0,0,0,0,0,null,{"$f":"Genanskaffelsespriser!$D95","v":8790.6489999999994},8790.6489999999994,0,0,1,1]
["Skelbrønd, Konstruktioner","stk.",{"$f":"Genanskaffelsespriser!E96","v":50},0,null,null,0,"",null,{"$f":"Genanskaffelsespriser!$D96","v":10800.355},10800.355,"","",1,1]
["Skelbrønd, Mek./EL","stk.",{"$f":"Genanskaffelsespriser!E97","v":15},0,null,null,0,"",null,{"$f":"Genanskaffelsespriser!$D97","v":16201.050999999999},16201.050999999999,"","",1,1]
["Inspektionsbrønd, Konstruktioner","stk.",{"$f":"Genanskaffelsespriser!E98","v":50},0,null,null,0,"",null,{"$f":"Genanskaffelsespriser!$D98","v":10800.355},10800.355,"","",1,1]
["Inspektionsbrønd, Mek./EL","stk.",{"$f":"Genanskaffelsespriser!E99","v":15},0,null,null,0,"",null,{"$f":"Genanskaffelsespriser!$D99","v":13500.703},13500.703,"","",1,1]
["Stik på ledningsnet, Konstruktioner","stk.",{"$f":"Genanskaffelsespriser!E100","v":75},254,271,271,6.6929133858267723E-2,0,null,{"$f":"Genanskaffelsespriser!$D100","v":4896.7139999999999},4896.7139999999999,17693.459919999998,17693.459919999998,1,1]
["Stik på ledningsnet, Mek./EL","stk.",{"$f":"Genanskaffelsespriser!E101","v":75},254,271,271,6.6929133858267723E-2,0,null,{"$f":"Genanskaffelsespriser!$D101","v":4896.7139999999999},4896.7139999999999,17693.459919999998,17693.459919999998,1,1]
["Ledningsnet - By"]
["Ledningsnet ≤ Ø50 mm","meter",{"$f":"Genanskaffelsespriser!E103","v":75},16135.334551309707,15748.835852521988,15585.903072321591,-2.3953559658689946E-2,-1.0345703119021683E-2,null,{"$f":"Genanskaffelsespriser!$D103","v":674.05},{"$f":"J25","v":674.05},141540.03741856595,140075.70621197825,1,1]
["Ø 50mm < Ledningsnet ≤ Ø110 mm","meter",{"$f":"Genanskaffelsespriser!E104","v":75},115333.3617742658,117043.07656070043,116774.5314325435,1.482411298979512E-2,-2.2944127585167668E-3,null,{"$f":"Genanskaffelsespriser!$D104","v":993.44599999999991},{"$f":"J26","v":993.44599999999991},1550346.3498256213,1546789.2153804614,1,1]
["Ø110 mm < Ledningsnet ≤ Ø 250 mm","meter",{"$f":"Genanskaffelsespriser!E105","v":75},41627.405455316934,41712.763206996664,42006.701959599734,2.0505181801770919E-3,7.0467341409251438E-3,null,{"$f":"Genanskaffelsespriser!$D105","v":1746.3079999999998},1746.3079999999998,971244.4278731189,978088.52914219582,1,1]
["Ø 250 mm < Ledningsnet ≤ Ø 500mm","meter",{"$f":"Genanskaffelsespriser!E106","v":75},6898.3430199776658,6898.3430199776685,7438.7591394416449,3.9552746180018439E-16,7.8339989458182366E-2,null,{"$f":"Genanskaffelsespriser!$D106","v":3269.6609999999996},3269.6609999999996,300736.57516057603,324296.27528834541,1,1]
["Ledningsnet > Ø 500 mm","meter",{"$f":"Genanskaffelsespriser!E107","v":75},3003.8702438858272,3003.8702438858313,2998.1419417506413,1.3624843371009922E-15,-1.9069738937124751E-3,null,{"$f":"Genanskaffelsespriser!$D107","v":6219.9259999999995},6219.9259999999995,249118.00840762426,248642.94686913729,1,1]
["Støbejernsledninger ≤ Ø50 mm","meter",{"$f":"Genanskaffelsespriser!E108","v":100},829.15853482396699,787.50100776844829,786.02510092023113,-5.0240726358033241E-2,-1.8741650279273424E-3,null,{"$f":"Genanskaffelsespriser!$D108","v":1057.74},1057.74,8329.7131595699848,8314.1019024736524,1,1]
["Støbejernsledninger Ø 50mm < Ledningsnet ≤ Ø110 mm","meter",{"$f":"Genanskaffelsespriser!E109","v":100},6882.4773572234999,7246.384712002161,7201.6607055783816,5.2874471776753813E-2,-6.1719061575220011E-3,null,{"$f":"Genanskaffelsespriser!$D109","v":1247.511},1247.511,90399.446384545285,89841.509484767914,1,1]
["Støbejernsledninger Ø110 mm < Ledningsnet ≤ Ø 250 mm","meter",{"$f":"Genanskaffelsespriser!E110","v":100},4452.5615846529545,4583.1511320983818,4562.0054739298321,2.9329082812810971E-2,-4.6137815575085055E-3,null,{"$f":"Genanskaffelsespriser!$D110","v":1722.4569999999999},1722.4569999999999,78942.807495407818,78578.582626087562,1,1]
["Støbejernsledninger Ø 250 mm < Ledningsnet ≤ Ø 500mm","meter",{"$f":"Genanskaffelsespriser!E111","v":100},104.73298046315949,104.73298046315922,104.53510008888701,-2.5780440735553642E-15,-1.8893797674536972E-3,null,{"$f":"Genanskaffelsespriser!$D111","v":3080.9269999999997},3080.9269999999997,3226.7466729941971,3220.6501231155435,1,1]
["Støbejernsledninger Ledningsnet > Ø 500 mm","meter",{"$f":"Genanskaffelsespriser!E112","v":100},0,0,0,0,0,null,{"$f":"Genanskaffelsespriser!$D112","v":5943.0469999999996},5943.0469999999996,0,0,1,1]
["Eternitledninger ≤ Ø50 mm","meter",{"$f":"Genanskaffelsespriser!E113","v":75},197.0640841605032,197.06408416050206,196.54625724300499,-5.7690288012614856E-15,-2.627708238683019E-3,null,{"$f":"Genanskaffelsespriser!$D113","v":804.71199999999999},804.71199999999999,2114.3977772395456,2108.8417567804404,1,1]
["Eternitledninger Ø 50mm < Ledningsnet ≤ Ø110 mm","meter",{"$f":"Genanskaffelsespriser!E114","v":75},1668.1931749539615,1668.1992114612976,1663.8678839374882,3.618590117007719E-6,-2.596409046384425E-3,null,{"$f":"Genanskaffelsespriser!$D114","v":1073.2949999999998},1073.2949999999998,23872.931635538043,23810.947739875814,1,1]
["Eternitledninger Ø110 mm < Ledningsnet ≤ Ø 250 mm","meter",{"$f":"Genanskaffelsespriser!E115","v":75},10511.384860780907,10345.91761255565,9774.6187449351346,-1.574171723486532E-2,-5.5219738742863692E-2,null,{"$f":"Genanskaffelsespriser!$D115","v":1509.8719999999998},1509.8719999999998,208280.15090006162,196778.97538203601,1,1]
["Eternitledninger Ø 250 mm < Ledningsnet ≤ Ø 500mm","meter",{"$f":"Genanskaffelsespriser!E116","v":75},6123.0633042503823,6129.9962753950576,5559.7690484718087,1.1322716751699649E-3,-9.3022442641941039E-2,null,{"$f":"Genanskaffelsespriser!$D116","v":3385.8049999999998},3385.8049999999998,276732.96052285284,250990.58457548122,1,1]
["Eternitledninger Ledningsnet > Ø 500 mm","meter",{"$f":"Genanskaffelsespriser!E117","v":75},0,null,null,0,"",null,{"$f":"Genanskaffelsespriser!$D117","v":9046.7879999999986},9046.7879999999986,"","",1,1]
["Skelbrønd, Konstruktioner","stk.",{"$f":"Genanskaffelsespriser!E118","v":50},0,null,null,0,"",null,{"$f":"Genanskaffelsespriser!$D118","v":11880.909},11880.909,"","",1,1]
["Skelbrønd, Mek./EL","stk.",{"$f":"Genanskaffelsespriser!E119","v":15},0,null,null,0,"",null,{"$f":"Genanskaffelsespriser!$D119","v":17820.844999999998},17820.844999999998,"","",1,1]
["Inspektionsbrønd, Konstruktioner","stk.",{"$f":"Genanskaffelsespriser!E120","v":50},0,null,null,0,"",null,{"$f":"Genanskaffelsespriser!$D120","v":11880.909},11880.909,"","",1,1]
["Inspektionsbrønd, Mek./EL","stk.",{"$f":"Genanskaffelsespriser!E121","v":15},0,null,null,0,"",null,{"$f":"Genanskaffelsespriser!$D121","v":14850.876999999999},14850.876999999999,"","",1,1]
["Stik på ledningsnet, Konstruktioner","stk.",{"$f":"Genanskaffelsespriser!E122","v":75},8672,9239,9269,6.538284132841328E-2,3.2471046650070353E-3,null,{"$f":"Genanskaffelsespriser!$D122","v":5875.6419999999998},5875.6419999999998,723800.7525066667,726151.00930666667,1,1]
["Stik på ledningsnet, Mek./EL","stk.",{"$f":"Genanskaffelsespriser!E123","v":75},8672,9239,9269,6.538284132841328E-2,3.2471046650070353E-3,null,{"$f":"Genanskaffelsespriser!$D123","v":5875.6419999999998},5875.6419999999998,723800.7525066667,726151.00930666667,1,1]
["Ledningsnet - City"]
["Ledningsnet ≤ Ø50 mm","meter",{"$f":"Genanskaffelsespriser!E125","v":75},927.20548207994466,926.52943851737564,854.84959610479712,-7.2911946233589187E-4,-7.7363804572987971E-2,null,{"$f":"Genanskaffelsespriser!$D125","v":1117.886},{"$f":"J47","v":1117.886},13810.057172085799,12741.658607882762,1,1]
["Ø 50mm < Ledningsnet ≤ Ø110 mm","meter",{"$f":"Genanskaffelsespriser!E126","v":75},9959.2950242853003,10241.007234385634,10308.720643528242,2.8286360572047576E-2,6.6119872384477335E-3,null,{"$f":"Genanskaffelsespriser!$D126","v":1550.3149999999998},{"$f":"J48","v":1550.3149999999998},211690.49507435417,213090.18992628646,1,1]
["Ø110 mm < Ledningsnet ≤ Ø 250 mm","meter",{"$f":"Genanskaffelsespriser!E127","v":75},6789.471340801555,6794.0761065967081,6777.7853314306521,6.7822155275633572E-4,-2.3977910918952482E-3,null,{"$f":"Genanskaffelsespriser!$D127","v":2273.1039999999998},2273.1039999999998,205915.2209894587,205421.47930688455,1,1]
["Ø 250 mm < Ledningsnet ≤ Ø 500mm","meter",{"$f":"Genanskaffelsespriser!E128","v":75},973.86181060099011,973.47703297641078,971.660008754194,-3.9510495266456157E-4,-1.8665301395567873E-3,null,{"$f":"Genanskaffelsespriser!$D128","v":3912.6009999999997},3912.6009999999997,50784.362836007167,50689.572292155572,1,1]
["Ledningsnet > Ø 500 mm","meter",{"$f":"Genanskaffelsespriser!E129","v":75},174.976858829554,174.97685882955489,174.67838073517402,5.0353686666691317E-15,-1.7058146795949543E-3,null,{"$f":"Genanskaffelsespriser!$D129","v":6981.0839999999998},6981.0839999999998,16287.041993936857,16259.259318616421,1,1]
["Støbejernsledninger ≤ Ø50 mm","meter",{"$f":"Genanskaffelsespriser!E130","v":100},146.59170766887001,146.79961780571358,146.60556437165599,1.4182939823117794E-3,-1.3218933193301606E-3,null,{"$f":"Genanskaffelsespriser!$D130","v":1501.5759999999998},1501.5759999999998,2204.3078290623216,2201.3939692693366,1,1]
["Støbejernsledninger Ø 50mm < Ledningsnet ≤ Ø110 mm","meter",{"$f":"Genanskaffelsespriser!E131","v":100},408.45828493478695,342.0646107378148,175.61612638504198,-0.16254701311193218,-0.48659954619027229,"Nedlagt dobbeltstræk ",{"$f":"Genanskaffelsespriser!$D131","v":1804.3799999999999},1804.3799999999999,6172.1454232309825,3168.7822612664204,1,1]
["Støbejernsledninger Ø110 mm < Ledningsnet ≤ Ø 250 mm","meter",{"$f":"Genanskaffelsespriser!E132","v":100},2535.944405830588,2580.5164445271153,2575.4370028729591,1.7576110341397135E-2,-1.9683818194334416E-3,null,{"$f":"Genanskaffelsespriser!$D132","v":2249.2529999999997},2249.2529999999997,58042.343544019473,57928.094050230116,1,1]
["Støbejernsledninger Ø 250 mm < Ledningsnet ≤ Ø 500mm","meter",{"$f":"Genanskaffelsespriser!E133","v":100},0,0,0,0,0,null,{"$f":"Genanskaffelsespriser!$D133","v":3723.8669999999997},3723.8669999999997,0,0,1,1]
["Støbejernsledninger Ledningsnet > Ø 500 mm","meter",{"$f":"Genanskaffelsespriser!E134","v":100},0,0,0,0,0,null,{"$f":"Genanskaffelsespriser!$D134","v":6704.2049999999999},6704.2049999999999,0,0,1,1]
["Eternitledninger ≤ Ø50 mm","meter",{"$f":"Genanskaffelsespriser!E135","v":75},0,0,0,0,0,null,{"$f":"Genanskaffelsespriser!$D135","v":1248.548},1248.548,0,0,1,1]
["Eternitledninger Ø 50mm < Ledningsnet ≤ Ø110 mm","meter",{"$f":"Genanskaffelsespriser!E136","v":75},66.868788575375106,66.868788575375405,66.644126587594997,4.462888522092058E-15,-3.3597436497173248E-3,null,{"$f":"Genanskaffelsespriser!$D136","v":1630.164},1630.164,1453.4278914558436,1448.5447463272028,1,1]
["Eternitledninger Ø110 mm < Ledningsnet ≤ Ø 250 mm","meter",{"$f":"Genanskaffelsespriser!E137","v":75},1885.2623929538172,1719.5372799709828,1685.4924392489434,-8.7905595317783497E-2,-1.9798838395997997E-2,null,{"$f":"Genanskaffelsespriser!$D137","v":2038.7419999999997},2038.7419999999997,46742.571643234674,45817.123021056919,1,1]
["Eternitledninger Ø 250 mm < Ledningsnet ≤ Ø 500mm","meter",{"$f":"Genanskaffelsespriser!E138","v":75},1883.6999317550274,1883.6999317550119,1877.5183519010729,-8.2080004726307525E-15,-3.2816160099234494E-3,null,{"$f":"Genanskaffelsespriser!$D138","v":4028.7449999999999},4028.7449999999999,101185.95575411127,100853.90230172918,1,1]
["Eternitledninger Ledningsnet > Ø 500 mm","meter",{"$f":"Genanskaffelsespriser!E139","v":75},0,null,null,0,"",null,{"$f":"Genanskaffelsespriser!$D139","v":9807.9459999999999},9807.9459999999999,"","",1,1]
["Skelbrønd, Konstruktioner","stk.",{"$f":"Genanskaffelsespriser!E140","v":50},0,null,null,0,"",null,{"$f":"Genanskaffelsespriser!$D140","v":12960.425999999999},12960.425999999999,"","",1,1]
["Skelbrønd, Mek./EL","stk.",{"$f":"Genanskaffelsespriser!E141","v":15},0,null,null,0,"",null,{"$f":"Genanskaffelsespriser!$D141","v":19440.638999999999},19440.638999999999,"","",1,1]
["Inspektionsbrønd, Konstruktioner","stk.",{"$f":"Genanskaffelsespriser!E142","v":50},0,null,null,0,"",null,{"$f":"Genanskaffelsespriser!$D142","v":12960.425999999999},12960.425999999999,"","",1,1]
["Inspektionsbrønd, Mek./EL","stk.",{"$f":"Genanskaffelsespriser!E143","v":15},0,null,null,0,"",null,{"$f":"Genanskaffelsespriser!$D143","v":16201.050999999999},16201.050999999999,"","",1,1]
["Stik på ledningsnet, Konstruktioner","stk.",{"$f":"Genanskaffelsespriser!E144","v":75},662,705,708,6.4954682779456194E-2,4.2553191489361703E-3,null,{"$f":"Genanskaffelsespriser!$D144","v":6366.1429999999991},6366.1429999999991,59841.744199999994,60096.389919999987,1,1]
["Stik på ledningsnet, Mek./EL","stk.",{"$f":"Genanskaffelsespriser!E145","v":75},662,705,708,6.4954682779456194E-2,4.2553191489361703E-3,null,{"$f":"Genanskaffelsespriser!$D145","v":6366.1429999999991},6366.1429999999991,59841.744199999994,60096.389919999987,1,1]
["Ledningsnet - Indre city"]
["Ledningsnet ≤ Ø50 mm","meter",{"$f":"Genanskaffelsespriser!E147","v":75},0,null,null,{"$f":"IF($D69=\"\",IF($E69>0,\"Ny data\",IF($E69=\"\",\"\",0)),IF($D69=0,IF($E69=0,0,\"Ny data\"),($E69-$D69)/$D69))","v":0},{"$f":"IF($E69=\"\",IF($F69>0,\"Ny data\",IF($F69=\"\",\"\",0)),IF($E69=0,IF($F69=0,0,\"Ny data\"),($F69-$E69)/$E69))","v":""},null,{"$f":"Genanskaffelsespriser!$D147","v":1759.7889999999998},{"$f":"J69","v":1759.7889999999998},{"$f":"IF(ISNUMBER(E69),((J69*E69)/C69)*N69,\"\")","v":""},{"$f":"IF(ISNUMBER(F69),((K69*F69)/C69)*O69,\"\")","v":""},1,1]
["Ø 50mm < Ledningsnet ≤ Ø110 mm","meter",{"$f":"Genanskaffelsespriser!E148","v":75},0,null,null,0,"",null,{"$f":"Genanskaffelsespriser!$D148","v":2351.9159999999997},{"$f":"J70","v":2351.9159999999997},"","",1,1]
["Ø110 mm < Ledningsnet ≤ Ø 250 mm","meter",{"$f":"Genanskaffelsespriser!E149","v":75},0,null,null,0,"",null,{"$f":"Genanskaffelsespriser!$D149","v":3120.3329999999996},3120.3329999999996,"","",1,1]
["Ø 250 mm < Ledningsnet ≤ Ø 500mm","meter",{"$f":"Genanskaffelsespriser!E150","v":75},0,null,null,0,"",null,{"$f":"Genanskaffelsespriser!$D150","v":4949.6009999999997},4949.6009999999997,"","",1,1]
["Ledningsnet > Ø 500 mm","meter",{"$f":"Genanskaffelsespriser!E151","v":75},0,null,null,0,"",null,{"$f":"Genanskaffelsespriser!$D151","v":8207.8549999999996},8207.8549999999996,"","",1,1]
["Støbejernsledninger ≤ Ø50 mm","meter",{"$f":"Genanskaffelsespriser!E152","v":100},0,null,null,0,"",null,{"$f":"Genanskaffelsespriser!$D152","v":2143.4789999999998},2143.4789999999998,"","",1,1]
["Støbejernsledninger Ø 50mm < Ledningsnet ≤ Ø110 mm","meter",{"$f":"Genanskaffelsespriser!E153","v":100},0,null,null,0,"",null,{"$f":"Genanskaffelsespriser!$D153","v":2605.9809999999998},2605.9809999999998,"","",1,1]
["Støbejernsledninger Ø110 mm < Ledningsnet ≤ Ø 250 mm","meter",{"$f":"Genanskaffelsespriser!E154","v":100},0,null,null,0,"",null,{"$f":"Genanskaffelsespriser!$D154","v":3096.482},3096.482,"","",1,1]
["Støbejernsledninger Ø 250 mm < Ledningsnet ≤ Ø 500mm","meter",{"$f":"Genanskaffelsespriser!E155","v":100},0,null,null,0,"",null,{"$f":"Genanskaffelsespriser!$D155","v":4760.8669999999993},4760.8669999999993,"","",1,1]
["Støbejernsledninger Ledningsnet > Ø 500 mm","meter",{"$f":"Genanskaffelsespriser!E156","v":100},0,null,null,0,"",null,{"$f":"Genanskaffelsespriser!$D156","v":7930.9759999999997},7930.9759999999997,"","",1,1]
["Eternitledninger ≤ Ø50 mm","meter",{"$f":"Genanskaffelsespriser!E157","v":75},0,null,null,0,"",null,{"$f":"Genanskaffelsespriser!$D157","v":1890.4509999999998},1890.4509999999998,"","",1,1]
["Eternitledninger Ø 50mm < Ledningsnet ≤ Ø110 mm","meter",{"$f":"Genanskaffelsespriser!E158","v":75},0,null,null,0,"",null,{"$f":"Genanskaffelsespriser!$D158","v":2431.7649999999999},2431.7649999999999,"","",1,1]
["Eternitledninger Ø110 mm < Ledningsnet ≤ Ø 250 mm","meter",{"$f":"Genanskaffelsespriser!E159","v":75},0,null,null,0,"",null,{"$f":"Genanskaffelsespriser!$D159","v":2885.971},2885.971,"","",1,1]
["Eternitledninger Ø 250 mm < Ledningsnet ≤ Ø 500mm","meter",{"$f":"Genanskaffelsespriser!E160","v":75},0,null,null,0,"",null,{"$f":"Genanskaffelsespriser!$D160","v":5065.7449999999999},5065.7449999999999,"","",1,1]
["Eternitledninger Ledningsnet > Ø 500 mm","meter",{"$f":"Genanskaffelsespriser!E161","v":75},0,null,null,0,"",null,{"$f":"Genanskaffelsespriser!$D161","v":11034.716999999999},11034.716999999999,"","",1,1]
["Skelbrønd, Konstruktioner","stk.",{"$f":"Genanskaffelsespriser!E162","v":50},0,null,null,0,"",null,{"$f":"Genanskaffelsespriser!$D162","v":14040.98},14040.98,"","",1,1]
["Skelbrønd, Mek./EL","stk.",{"$f":"Genanskaffelsespriser!E163","v":15},0,null,null,0,"",null,{"$f":"Genanskaffelsespriser!$D163","v":21061.469999999998},21061.469999999998,"","",1,1]
["Inspektionsbrønd, Konstruktioner","stk.",{"$f":"Genanskaffelsespriser!E164","v":50},0,null,null,0,"",null,{"$f":"Genanskaffelsespriser!$D164","v":14040.98},14040.98,"","",1,1]
["Inspektionsbrønd, Mek./EL","stk.",{"$f":"Genanskaffelsespriser!E165","v":15},0,null,null,0,"",null,{"$f":"Genanskaffelsespriser!$D165","v":17551.224999999999},17551.224999999999,"","",1,1]
["Stik på ledningsnet, Konstruktioner","stk.",{"$f":"Genanskaffelsespriser!E166","v":75},0,null,null,0,"",null,{"$f":"Genanskaffelsespriser!$D166","v":7834.5349999999999},7834.5349999999999,"","",1,1]
["Stik på ledningsnet, Mek./EL","stk.",{"$f":"Genanskaffelsespriser!E167","v":75},0,null,null,0,"",null,{"$f":"Genanskaffelsespriser!$D167","v":7834.5349999999999},7834.5349999999999,"","",1,1]
["Ventiler"]
["Ventiler på ledningsnet ≤ Ø50 mm","stk.",{"$f":"Genanskaffelsespriser!E169","v":75},266,266,266,0,0,null,{"$f":"Genanskaffelsespriser!$D169","v":8018.0839999999998},{"$f":"J91","v":8018.0839999999998},28437.471253333333,28437.471253333333,1,1]
["Ventiler på Ø 50mm < Ledningsnet ≤ Ø110 mm","stk.",{"$f":"Genanskaffelsespriser!E170","v":75},1848,1848,1848,0,0,null,{"$f":"Genanskaffelsespriser!$D170","v":9312.2599999999984},{"$f":"J92","v":9312.2599999999984},229454.08639999994,229454.08639999994,1,1]
["Ventiler på Ø110 mm < Ledningsnet ≤ Ø 250 mm","stk.",{"$f":"Genanskaffelsespriser!E171","v":75},667,667,667,0,0,null,{"$f":"Genanskaffelsespriser!$D171","v":22540.232},22540.232,200457.79658666669,200457.79658666669,1,1]
["Ventiler på Ø 250 mm < Ledningsnet ≤ Ø 500mm","stk.",{"$f":"Genanskaffelsespriser!E172","v":75},83,83,83,{"$f":"IF($D94=\"\",IF($E94>0,\"Ny data\",IF($E94=\"\",\"\",0)),IF($D94=0,IF($E94=0,0,\"Ny data\"),($E94-$D94)/$D94))","v":0},{"$f":"IF($E94=\"\",IF($F94>0,\"Ny data\",IF($F94=\"\",\"\",0)),IF($E94=0,IF($F94=0,0,\"Ny data\"),($F94-$E94)/$E94))","v":0},null,{"$f":"Genanskaffelsespriser!$D172","v":81196.062999999995},81196.062999999995,89856.976386666662,89856.976386666662,1,1]
["Ventiler på ledningsnet > Ø 500 mm","stk.",{"$f":"Genanskaffelsespriser!E173","v":75},1,1,1,0,0,null,{"$f":"Genanskaffelsespriser!$D173","v":232011.12099999998},232011.12099999998,3093.4816133333329,3093.4816133333329,1,1]
["Pumpestationer, bygværker og bassiner 1"]
["Pumpestation (inkl. evt. hydrofor)/trykforøger, Konstruktioner","m³/h ",{"$f":"+Genanskaffelsespriser!$E$175","v":50},1050,1050,1050,0,0,null,{"$f":"IF(E97=0,\"Variabel pris\",IFERROR((HLOOKUP(E97,'Variable priser'!$C$103:$F$105,2)+(E97-HLOOKUP(E97,'Variable priser'!$C$103:$F$105,1))*HLOOKUP(E97,'Variable priser'!$C$103:$F$105,3))*'Variable priser'!$I$102/E97*(1+Genanskaffelsespriser!$D$203),\"Fejl\"))","v":790.96730571428554},{"$f":"IF(F97=0,\"Variabel pris\",IFERROR((HLOOKUP(F97,'Variable priser'!$C$103:$F$105,2)+(F97-HLOOKUP(F97,'Variable priser'!$C$103:$F$105,1))*HLOOKUP(F97,'Variable priser'!$C$103:$F$105,3))*'Variable priser'!$I$102/F97*(1+Genanskaffelsespriser!$D$203),\"Fejl\"))","v":790.96730571428554},{"$f":"IF(ISBLANK(E97),\"\",IF(E97=0,\"\",IF(ISNUMBER(E97),((J97*E97)/$C97)*N97,\"\")))","v":16610.313419999999},{"$f":"IF(ISBLANK(F97),\"\",IF(F97=0,\"\",IF(ISNUMBER(F97),((K97*F97)/$C97)*O97,\"\")))","v":16610.313419999999},1,1]
["Pumpestation (inkl. evt. hydrofor)/trykforøger, Mek./EL","m³/h ",{"$f":"+Genanskaffelsespriser!$E$176","v":25},1050,1050,1050,0,0,null,{"$f":"IF(E98=0,\"Variabel pris\",IFERROR((HLOOKUP(E98,'Variable priser'!$C$103:$F$105,2)+(E98-HLOOKUP(E98,'Variable priser'!$C$103:$F$105,1))*HLOOKUP(E98,'Variable priser'!$C$103:$F$105,3))*'Variable priser'!$J$102/E98*(1+Genanskaffelsespriser!$D$203),\"Fejl\"))","v":2056.5149948571425},{"$f":"IF(F98=0,\"Variabel pris\",IFERROR((HLOOKUP(F98,'Variable priser'!$C$103:$F$105,2)+(F98-HLOOKUP(F98,'Variable priser'!$C$103:$F$105,1))*HLOOKUP(F98,'Variable priser'!$C$103:$F$105,3))*'Variable priser'!$J$102/F98*(1+Genanskaffelsespriser!$D$203),\"Fejl\"))","v":2056.5149948571425},{"$f":"IF(ISBLANK(E98),\"\",IF(E98=0,\"\",IF(ISNUMBER(E98),((J98*E98)/$C98)*N97,\"\")))","v":86373.629783999975},{"$f":"IF(ISBLANK(F98),\"\",IF(F98=0,\"\",IF(ISNUMBER(F98),((K98*F98)/$C98)*O97,\"\")))","v":86373.629783999975},1,1]
["Pumpestation (inkl. evt. hydrofor)/trykforøger, SRO","m³/h ",{"$f":"+Genanskaffelsespriser!$E$177","v":10},1050,1050,1050,0,0,null,{"$f":"IF(E99=0,\"Variabel pris\",IFERROR((HLOOKUP(E99,'Variable priser'!$C$103:$F$105,2)+(E99-HLOOKUP(E99,'Variable priser'!$C$103:$F$105,1))*HLOOKUP(E99,'Variable priser'!$C$103:$F$105,3))*'Variable priser'!$L$102/E99*(1+Genanskaffelsespriser!$D$203),\"Fejl\"))","v":316.38692228571421},{"$f":"IF(F99=0,\"Variabel pris\",IFERROR((HLOOKUP(F99,'Variable priser'!$C$103:$F$105,2)+(F99-HLOOKUP(F99,'Variable priser'!$C$103:$F$105,1))*HLOOKUP(F99,'Variable priser'!$C$103:$F$105,3))*'Variable priser'!$L$102/F99*(1+Genanskaffelsespriser!$D$203),\"Fejl\"))","v":316.38692228571421},{"$f":"IF(ISBLANK(E99),\"\",IF(E99=0,\"\",IF(ISNUMBER(E99),((J99*E99)/$C99)*N97,\"\")))","v":33220.626839999997},{"$f":"IF(ISBLANK(F99),\"\",IF(F99=0,\"Samlet mængde kan ikke være nul i 2025\",IF(ISNUMBER(F99),((K99*F99)/$C99)*O97,\"\")))","v":33220.626839999997},1,1]
["Beholderanlæg - højdebeholder","m³",{"$f":"+Genanskaffelsespriser!$E$178","v":50},0,0,0,0,0,null,{"$f":"IF(E100=0,\"Variabel pris\",IFERROR((HLOOKUP(E100,'Variable priser'!$C$48:$H$50,2)+(E100-HLOOKUP(E100,'Variable priser'!$C$48:$H$50,1))*HLOOKUP(E100,'Variable priser'!$C$48:$H$50,3))/E100*(1+Genanskaffelsespriser!$D$203),\"Fejl\"))","v":"Variabel pris"},{"$f":"IF(F100=0,\"Variabel pris\",IFERROR((HLOOKUP(F100,'Variable priser'!$C$48:$H$50,2)+(F100-HLOOKUP(F100,'Variable priser'!$C$48:$H$50,1))*HLOOKUP(F100,'Variable priser'!$C$48:$H$50,3))/F100*(1+Genanskaffelsespriser!$D$203),\"Fejl\"))","v":"Variabel pris"},{"$f":"IF(ISBLANK(E100),\"\",IF(E100=0,\"\",IF(ISNUMBER(E100),((J100*E100)/$C100)*N97,\"\")))","v":""},{"$f":"IF(ISBLANK(F100),\"\",IF(F100=0,\"\",IF(ISNUMBER(F100),((K100*F100)/$C100)*O97,\"\")))","v":""},1,1]
["Beholderanlæg - vandtårn","m³",{"$f":"+Genanskaffelsespriser!$E$179","v":50},1000,1000,1000,0,0,null,{"$f":"IF(E101=0,\"Variabel pris\",IFERROR((HLOOKUP(E101,'Variable priser'!$C$55:$H$57,2)+(E101-HLOOKUP(E101,'Variable priser'!$C$55:$H$57,1))*HLOOKUP(E101,'Variable priser'!$C$55:$H$57,3))/E101*(1+Genanskaffelsespriser!$D$203),\"Fejl\"))","v":6561.3013394399986},{"$f":"IF(F101=0,\"Variabel pris\",IFERROR((HLOOKUP(F101,'Variable priser'!$C$55:$H$57,2)+(F101-HLOOKUP(F101,'Variable priser'!$C$55:$H$57,1))*HLOOKUP(F101,'Variable priser'!$C$55:$H$57,3))/F101*(1+Genanskaffelsespriser!$D$203),\"Fejl\"))","v":6561.3013394399986},{"$f":"IF(ISBLANK(E101),\"\",IF(E101=0,\"\",IF(ISNUMBER(E101),((J101*E101)/$C101)*N97,\"\")))","v":131226.02678879997},{"$f":"IF(ISBLANK(F101),\"\",IF(F101=0,\"\",IF(ISNUMBER(F101),((K101*F101)/$C101)*O97,\"\")))","v":131226.02678879997},1,1]
["Pumpestationer, bygværker og bassiner 2"]
["Pumpestation (inkl. evt. hydrofor)/trykforøger, Konstruktioner","m³/h ",{"$f":"+Genanskaffelsespriser!$E$175","v":50},600,600,600,0,0,null,{"$f":"IF(E103=0,\"Variabel pris\",IFERROR((HLOOKUP(E103,'Variable priser'!$C$103:$F$105,2)+(E103-HLOOKUP(E103,'Variable priser'!$C$103:$F$105,1))*HLOOKUP(E103,'Variable priser'!$C$103:$F$105,3))*'Variable priser'!$I$102/E103*(1+Genanskaffelsespriser!$D$203),\"Fejl\"))","v":818.90172468749995},{"$f":"IF(F103=0,\"Variabel pris\",IFERROR((HLOOKUP(F103,'Variable priser'!$C$103:$F$105,2)+(F103-HLOOKUP(F103,'Variable priser'!$C$103:$F$105,1))*HLOOKUP(F103,'Variable priser'!$C$103:$F$105,3))*'Variable priser'!$I$102/F103*(1+Genanskaffelsespriser!$D$203),\"Fejl\"))","v":818.90172468749995},{"$f":"IF(ISBLANK(E103),\"\",IF(E103=0,\"\",IF(ISNUMBER(E103),((J103*E103)/$C103)*N103,\"\")))","v":9826.8206962499989},{"$f":"IF(ISBLANK(F103),\"\",IF(F103=0,\"\",IF(ISNUMBER(F103),((K103*F103)/$C103)*O103,\"\")))","v":9826.8206962499989},1,1]
["Pumpestation (inkl. evt. hydrofor)/trykforøger, Mek./EL","m³/h ",{"$f":"+Genanskaffelsespriser!$E$176","v":25},600,600,600,0,0,null,{"$f":"IF(E104=0,\"Variabel pris\",IFERROR((HLOOKUP(E104,'Variable priser'!$C$103:$F$105,2)+(E104-HLOOKUP(E104,'Variable priser'!$C$103:$F$105,1))*HLOOKUP(E104,'Variable priser'!$C$103:$F$105,3))*'Variable priser'!$J$102/E104*(1+Genanskaffelsespriser!$D$203),\"Fejl\"))","v":2129.1444841875},{"$f":"IF(F104=0,\"Variabel pris\",IFERROR((HLOOKUP(F104,'Variable priser'!$C$103:$F$105,2)+(F104-HLOOKUP(F104,'Variable priser'!$C$103:$F$105,1))*HLOOKUP(F104,'Variable priser'!$C$103:$F$105,3))*'Variable priser'!$J$102/F104*(1+Genanskaffelsespriser!$D$203),\"Fejl\"))","v":2129.1444841875},{"$f":"IF(ISBLANK(E104),\"\",IF(E104=0,\"\",IF(ISNUMBER(E104),((J104*E104)/$C104)*N103,\"\")))","v":51099.4676205},{"$f":"IF(ISBLANK(F104),\"\",IF(F104=0,\"\",IF(ISNUMBER(F104),((K104*F104)/$C104)*O103,\"\")))","v":51099.4676205},1,1]
["Pumpestation (inkl. evt. hydrofor)/trykforøger, SRO","m³/h ",{"$f":"+Genanskaffelsespriser!$E$177","v":10},600,600,600,0,0,null,{"$f":"IF(E105=0,\"Variabel pris\",IFERROR((HLOOKUP(E105,'Variable priser'!$C$103:$F$105,2)+(E105-HLOOKUP(E105,'Variable priser'!$C$103:$F$105,1))*HLOOKUP(E105,'Variable priser'!$C$103:$F$105,3))*'Variable priser'!$L$102/E105*(1+Genanskaffelsespriser!$D$203),\"Fejl\"))","v":327.56068987500004},{"$f":"IF(F105=0,\"Variabel pris\",IFERROR((HLOOKUP(F105,'Variable priser'!$C$103:$F$105,2)+(F105-HLOOKUP(F105,'Variable priser'!$C$103:$F$105,1))*HLOOKUP(F105,'Variable priser'!$C$103:$F$105,3))*'Variable priser'!$L$102/F105*(1+Genanskaffelsespriser!$D$203),\"Fejl\"))","v":327.56068987500004},{"$f":"IF(ISBLANK(E105),\"\",IF(E105=0,\"\",IF(ISNUMBER(E105),((J105*E105)/$C105)*N103,\"\")))","v":19653.641392500002},{"$f":"IF(ISBLANK(F105),\"\",IF(F105=0,\"Samlet mængde kan ikke være nul i 2025\",IF(ISNUMBER(F105),((K105*F105)/$C105)*O103,\"\")))","v":19653.641392500002},1,1]
["Beholderanlæg - højdebeholder","m³",{"$f":"+Genanskaffelsespriser!$E$178","v":50},0,0,0,0,0,null,{"$f":"IF(E106=0,\"Variabel pris\",IFERROR((HLOOKUP(E106,'Variable priser'!$C$48:$H$50,2)+(E106-HLOOKUP(E106,'Variable priser'!$C$48:$H$50,1))*HLOOKUP(E106,'Variable priser'!$C$48:$H$50,3))/E106*(1+Genanskaffelsespriser!$D$203),\"Fejl\"))","v":"Variabel pris"},{"$f":"IF(F106=0,\"Variabel pris\",IFERROR((HLOOKUP(F106,'Variable priser'!$C$48:$H$50,2)+(F106-HLOOKUP(F106,'Variable priser'!$C$48:$H$50,1))*HLOOKUP(F106,'Variable priser'!$C$48:$H$50,3))/F106*(1+Genanskaffelsespriser!$D$203),\"Fejl\"))","v":"Variabel pris"},{"$f":"IF(ISBLANK(E106),\"\",IF(E106=0,\"\",IF(ISNUMBER(E106),((J106*E106)/$C106)*N103,\"\")))","v":""},{"$f":"IF(ISBLANK(F106),\"\",IF(F106=0,\"\",IF(ISNUMBER(F106),((K106*F106)/$C106)*O103,\"\")))","v":""},1,1]
["Beholderanlæg - vandtårn","m³",{"$f":"+Genanskaffelsespriser!$E$179","v":50},0,0,0,0,0,null,{"$f":"IF(E107=0,\"Variabel pris\",IFERROR((HLOOKUP(E107,'Variable priser'!$C$55:$H$57,2)+(E107-HLOOKUP(E107,'Variable priser'!$C$55:$H$57,1))*HLOOKUP(E107,'Variable priser'!$C$55:$H$57,3))/E107*(1+Genanskaffelsespriser!$D$203),\"Fejl\"))","v":"Variabel pris"},{"$f":"IF(F107=0,\"Variabel pris\",IFERROR((HLOOKUP(F107,'Variable priser'!$C$55:$H$57,2)+(F107-HLOOKUP(F107,'Variable priser'!$C$55:$H$57,1))*HLOOKUP(F107,'Variable priser'!$C$55:$H$57,3))/F107*(1+Genanskaffelsespriser!$D$203),\"Fejl\"))","v":"Variabel pris"},{"$f":"IF(ISBLANK(E107),\"\",IF(E107=0,\"\",IF(ISNUMBER(E107),((J107*E107)/$C107)*N103,\"\")))","v":""},{"$f":"IF(ISBLANK(F107),\"\",IF(F107=0,\"\",IF(ISNUMBER(F107),((K107*F107)/$C107)*O103,\"\")))","v":""},1,1]
["Andre"]
["Afregningsmålere, mekaniske, ","stk.",{"$f":"Genanskaffelsespriser!E181","v":8},77,54,45,-0.29870129870129869,-0.16666666666666666,"Målerudskiftning til fjernaflæsning",{"$f":"Genanskaffelsespriser!$D181","v":1348.1},{"$f":"J109","v":1348.1},9099.6749999999993,7583.0624999999991,1,1]
["Afregningsmålere, elektroniske med maksimal gennemstrømning ≤ 4 m3/t","stk.",10,11792,11922,12026,1.1024423337856174E-2,8.7233685623217573E-3,null,{"$f":"Genanskaffelsespriser!$D182","v":1503.6499999999999},{"$f":"J110","v":1503.6499999999999},1792651.5299999998,1808289.4899999998,1,1]
["Afregningsmålere, elektroniske med maksimal gennemstrømning > 4 m3/t ≤ 15 m3/t","stk.",10,487,504,517,3.4907597535934289E-2,2.5793650793650792E-2,null,{"$f":"Genanskaffelsespriser!$D183","v":2152.8119999999999},2152.8119999999999,108501.7248,111300.38039999999,1,1]
["Afregningsmålere, elektroniske med maksimal gennemstrømning > 15 m3/t ≤ 300 m3/t ","stk.",10,78,86,85,0.10256410256410256,-1.1627906976744186E-2,null,{"$f":"Genanskaffelsespriser!$D184","v":20740},20740,178364,176290,1,1]
["Afregningsmålere, elektroniske med maksimal gennemstrømning > 300 m3/t","stk.",10,0,null,null,0,"",null,{"$f":"Genanskaffelsespriser!$D185","v":26961.999999999996},26961.999999999996,"","",1,1]
["SRO-brønd/kvarterbrønd/sektionsbrønd, Konstruktioner","stk.",{"$f":"Genanskaffelsespriser!E186","v":50},22,22,22,{"$f":"IF($D114=\"\",IF($E114>0,\"Ny data\",IF($E114=\"\",\"\",0)),IF($D114=0,IF($E114=0,0,\"Ny data\"),($E114-$D114)/$D114))","v":0},{"$f":"IF($E114=\"\",IF($F114>0,\"Ny data\",IF($F114=\"\",\"\",0)),IF($E114=0,IF($F114=0,0,\"Ny data\"),($F114-$E114)/$E114))","v":0},null,{"$f":"Genanskaffelsespriser!$D186","v":81762.264999999999},81762.264999999999,{"$f":"IF(ISNUMBER(E114),((J114*E114)/C114)*N114,\"\")","v":35975.3966},{"$f":"IF(ISNUMBER(F114),((K114*F114)/C114)*O114,\"\")","v":35975.3966},1,1]
["SRO-brønd/kvarterbrønd/sektionsbrønd, Mek./EL","stk.",{"$f":"Genanskaffelsespriser!E187","v":15},22,22,22,0,0,null,{"$f":"Genanskaffelsespriser!$D187","v":93441.995999999999},93441.995999999999,137048.26079999999,137048.26079999999,1,1]
["SRO-brønd/kvarterbrønd/sektionsbrønd, SRO","stk.",{"$f":"Genanskaffelsespriser!E188","v":10},22,22,22,0,0,null,{"$f":"Genanskaffelsespriser!$D188","v":58401.765999999996},58401.765999999996,128483.88519999999,128483.88519999999,1,1]

{"sheet":"Fællesfunktionsanlæg","index":2,"n_rows":11,"n_cols":15,"rows_kept":11,"cut":false,"hidden":false,"merged":[]}
["Fællesfunktionsanlæg","Enhed","Standard-levetid","Samlet mængde per 31/12-2023","Samlet mængde per 31/12-2024","Samlet mængde per 31/12-2025","Afvigelse\n2023-2024","Afvigelse\n2024-2025","Bemærkninger","Enhedspris\n2024","Enhedspris\n2025","Netvolumenbidrag\n2024","Netvolumenbidrag\n2025","Ejerandel 2024 (%)","Ejerandel 2025 (%)"]
["Andre",null,null,null,null,null,{"$f":"IF($D$2=\"\",IF($E$2>0,\"Ny data\",IF($E$2=\"\",\"\",0)),IF($D$2=0,IF($E$2=0,0,\"Ny data\"),($E$2-$D$2)/$D$2))","v":""},{"$f":"IF($E$2=\"\",IF($F$2>0,\"Ny data\",IF($F$2=\"\",\"\",0)),IF($E$2=0,IF($F$2=0,0,\"Ny data\"),($F$2-$E$2)/$E$2))","v":""},null,null,null,null,null,1]
["Arbejdsplads og kontor","stk.",5,30.2,32.3172,35.532000000000004,{"$f":"IF($D$3=\"\",IF($E$3>0,\"Ny data\",IF($E$3=\"\",\"\",0)),IF($D$3=0,IF($E$3=0,0,\"Ny data\"),($E$3-$D$3)/$D$3))","v":7.010596026490068E-2},{"$f":"IF($E$3=\"\",IF($F$3>0,\"Ny data\",IF($F$3=\"\",\"\",0)),IF($E$3=0,IF($F$3=0,0,\"Ny data\"),($F$3-$E$3)/$E$3))","v":9.9476439790576035E-2},null,{"$f":"Genanskaffelsespriser!D193","v":36295},{"$f":"J3","v":36295},{"$f":"IF(ISNUMBER(E3),((J3*E3)/C3)*N3,\"\")","v":234590.55479999998},{"$f":"IF(ISNUMBER(F3),((K3*F3)/C3)*O3,\"\")","v":257926.78800000003},1,1]
["Køretøjer, personbil","stk.",5,0.76,0.76140000000000019,0.67680000000000007,{"$f":"IF($D$4=\"\",IF($E$4>0,\"Ny data\",IF($E$4=\"\",\"\",0)),IF($D$4=0,IF($E$4=0,0,\"Ny data\"),($E$4-$D$4)/$D$4))","v":1.8421052631581302E-3},{"$f":"IF($E$4=\"\",IF($F$4>0,\"Ny data\",IF($F$4=\"\",\"\",0)),IF($E$4=0,IF($F$4=0,0,\"Ny data\"),($F$4-$E$4)/$E$4))","v":-0.11111111111111124},null,{"$f":"Genanskaffelsespriser!D194","v":225000},{"$f":"J4","v":225000},{"$f":"IF(ISNUMBER(E4),((J4*E4)/C4)*N4,\"\")","v":34263.000000000007},{"$f":"IF(ISNUMBER(F4),((K4*F4)/C4)*O4,\"\")","v":30456.000000000007},1,1]
["Køretøjer, små lastvogne (< 3.500 kg.)","stk.",5,7.36,7.2756000000000007,7.6986000000000017,{"$f":"IF($D$5=\"\",IF($E$5>0,\"Ny data\",IF($E$5=\"\",\"\",0)),IF($D$5=0,IF($E$5=0,0,\"Ny data\"),($E$5-$D$5)/$D$5))","v":-1.146739130434777E-2},{"$f":"IF($E$5=\"\",IF($F$5>0,\"Ny data\",IF($F$5=\"\",\"\",0)),IF($E$5=0,IF($F$5=0,0,\"Ny data\"),($F$5-$E$5)/$E$5))","v":5.8139534883721054E-2},null,{"$f":"Genanskaffelsespriser!D195","v":250000},250000,363780.00000000006,384930.00000000012,1,1]
["Køretøjer, store lastvogne (> 3.500 kg.)","stk.",5,3.3,3.2148000000000003,2.9610000000000003,{"$f":"IF($D$6=\"\",IF($E$6>0,\"Ny data\",IF($E$6=\"\",\"\",0)),IF($D$6=0,IF($E$6=0,0,\"Ny data\"),($E$6-$D$6)/$D$6))","v":-2.5818181818181667E-2},{"$f":"IF($E$6=\"\",IF($F$6>0,\"Ny data\",IF($F$6=\"\",\"\",0)),IF($E$6=0,IF($F$6=0,0,\"Ny data\"),($F$6-$E$6)/$E$6))","v":-7.8947368421052627E-2},null,{"$f":"Genanskaffelsespriser!$D196","v":1300000},1300000,835848.00000000012,769860.00000000012,1,1]
["Køretøjer, entreprenørmaskiner","stk.",5,0,0,0,{"$f":"IF($D$7=\"\",IF($E$7>0,\"Ny data\",IF($E$7=\"\",\"\",0)),IF($D$7=0,IF($E$7=0,0,\"Ny data\"),($E$7-$D$7)/$D$7))","v":0},{"$f":"IF($E$7=\"\",IF($F$7>0,\"Ny data\",IF($F$7=\"\",\"\",0)),IF($E$7=0,IF($F$7=0,0,\"Ny data\"),($F$7-$E$7)/$E$7))","v":0},null,{"$f":"Genanskaffelsespriser!D197","v":400000},400000,0,0,1,1]
["Solcelleanlæg ekskl. Inverter","kWp",25,0,0,0,{"$f":"IF($D$8=\"\",IF($E$8>0,\"Ny data\",IF($E$8=\"\",\"\",0)),IF($D$8=0,IF($E$8=0,0,\"Ny data\"),($E$8-$D$8)/$D$8))","v":0},{"$f":"IF($E$8=\"\",IF($F$8>0,\"Ny data\",IF($F$8=\"\",\"\",0)),IF($E$8=0,IF($F$8=0,0,\"Ny data\"),($F$8-$E$8)/$E$8))","v":0},null,{"$f":"Genanskaffelsespriser!D199","v":5400},5400,{"$f":"IF(OR(ISBLANK(E8),ISBLANK(N8)),\"\",(((E8*J8)/C8)*N8)*(IF(SUM(E10:E11)<>0,E11/SUM(E10:E11),1)))","v":0},{"$f":"IF(OR(ISBLANK(F8),ISBLANK(O8)),\"\",(((F8*K8)/C8)*O8)*(IF(SUM(F10:F11)<>0,F11/SUM(F10:F11),1)))","v":0},1,1]
["Inverter til solcelleanlæg","kWp",10,0,0,0,{"$f":"IF($D$9=\"\",IF($E$9>0,\"Ny data\",IF($E$9=\"\",\"\",0)),IF($D$9=0,IF($E$9=0,0,\"Ny data\"),($E$9-$D$9)/$D$9))","v":0},{"$f":"IF($E$9=\"\",IF($F$9>0,\"Ny data\",IF($F$9=\"\",\"\",0)),IF($E$9=0,IF($F$9=0,0,\"Ny data\"),($F$9-$E$9)/$E$9))","v":0},null,{"$f":"Genanskaffelsespriser!D200","v":600},600,{"$f":"IF(OR(ISBLANK(E9),ISBLANK(N9)),\"\",(((E9*J9)/C9)*N9)*(IF(SUM(E10:E11)<>0,E11/SUM(E10:E11),1)))","v":0},{"$f":"IF(OR(ISBLANK(F9),ISBLANK(O9)),\"\",(((F9*K9)/C9)*O9)*(IF(SUM(F10:F11)<>0,F11/SUM(F10:F11),1)))","v":0},1,1]
["Internt brug af produceret solcellestrøm 2024","MWh",null,0,0,0,{"$f":"IF($D10=\"\",IF($E10>0,\"Ny data\",IF($E10=\"\",\"\",0)),IF($D10=0,IF($E10=0,0,\"Ny data\"),($E10-$D10)/$D10))","v":0},{"$f":"IF($E$10=\"\",IF($F$10>0,\"Ny data\",IF($F$10=\"\",\"\",0)),IF($E$10=0,IF($F$10=0,0,\"Ny data\"),($F$10-$E$10)/$E$10))","v":0},null,null,null,null,null,1,1]
["Eksternt afsat produceret solcellestrøm 2024","MWh",null,0,0,0,{"$f":"IF($D11=\"\",IF($E11>0,\"Ny data\",IF($E11=\"\",\"\",0)),IF($D11=0,IF($E11=0,0,\"Ny data\"),($E11-$D11)/$D11))","v":0},{"$f":"IF($E$11=\"\",IF($F$11>0,\"Ny data\",IF($F$11=\"\",\"\",0)),IF($E$11=0,IF($F$11=0,0,\"Ny data\"),($F$11-$E$11)/$E$11))","v":0},null,null,null,null,null,1,1]

{"sheet":"Genanskaffelsespriser","index":3,"n_rows":203,"n_cols":5,"rows_kept":203,"cut":false,"hidden":false,"merged":[[1048235,2,1048236,2],[1048235,3,1048236,3],[1048235,4,1048236,4],[1048442,2,1048443,2],[1048442,3,1048443,3],[1048442,4,1048443,4],[1047821,2,1047822,2],[1047821,3,1047822,3],[1047821,4,1047822,4],[1048028,2,1048029,2],[1048028,3,1048029,3],[1048028,4,1048029,4],[1047407,2,1047408,2],[1047407,3,1047408,3],[1047407,4,1047408,4],[1047614,2,1047615,2],[1047614,3,1047615,3],[1047614,4,1047615,4],[1046993,2,1046994,2],[1046993,3,1046994,3],[1046993,4,1046994,4],[1047200,2,1047201,2],[1047200,3,1047201,3],[1047200,4,1047201,4],[1046579,2,1046580,2],[1046579,3,1046580,3],[1046579,4,1046580,4],[1046786,2,1046787,2],[1046786,3,1046787,3],[1046786,4,1046787,4],[1046165,2,1046166,2],[1046165,3,1046166,3],[1046165,4,1046166,4],[1046372,2,1046373,2],[1046372,3,1046373,3],[1046372,4,1046373,4],[1045751,2,1045752,2],[1045751,3,1045752,3],[1045751,4,1045752,4],[1045958,2,1045959,2],[1045958,3,1045959,3],[1045958,4,1045959,4],[1045337,2,1045338,2],[1045337,3,1045338,3],[1045337,4,1045338,4],[1045544,2,1045545,2],[1045544,3,1045545,3],[1045544,4,1045545,4],[1044923,2,1044924,2],[1044923,3,1044924,3],[1044923,4,1044924,4],[1045130,2,1045131,2],[1045130,3,1045131,3],[1045130,4,1045131,4],[1044509,2,1044510,2],[1044509,3,1044510,3],[1044509,4,1044510,4],[1044716,2,1044717,2],[1044716,3,1044717,3],[1044716,4,1044717,4],[1044095,2,1044096,2],[1044095,3,1044096,3],[1044095,4,1044096,4],[1044302,2,1044303,2],[1044302,3,1044303,3],[1044302,4,1044303,4],[1043681,2,1043682,2],[1043681,3,1043682,3],[1043681,4,1043682,4],[1043888,2,1043889,2],[1043888,3,1043889,3],[1043888,4,1043889,4],[1043267,2,1043268,2],[1043267,3,1043268,3],[1043267,4,1043268,4],[1043474,2,1043475,2],[1043474,3,1043475,3],[1043474,4,1043475,4],[1042853,2,1042854,2],[1042853,3,1042854,3],[1042853,4,1042854,4],[1043060,2,1043061,2],[1043060,3,1043061,3],[1043060,4,1043061,4],[1042439,2,1042440,2],[1042439,3,1042440,3],[1042439,4,1042440,4],[1042646,2,1042647,2],[1042646,3,1042647,3],[1042646,4,1042647,4],[1042025,2,1042026,2],[1042025,3,1042026,3],[1042025,4,1042026,4],[1042232,2,1042233,2],[1042232,3,1042233,3],[1042232,4,1042233,4],[1041611,2,1041612,2],[1041611,3,1041612,3],[1041611,4,1041612,4],[1041818,2,1041819,2],[1041818,3,1041819,3],[1041818,4,1041819,4],[1041197,2,1041198,2],[1041197,3,1041198,3],[1041197,4,1041198,4],[1041404,2,1041405,2],[1041404,3,1041405,3],[1041404,4,1041405,4],[1040783,2,1040784,2],[1040783,3,1040784,3],[1040783,4,1040784,4],[1040990,2,1040991,2],[1040990,3,1040991,3],[1040990,4,1040991,4],[1040369,2,1040370,2],[1040369,3,1040370,3],[1040369,4,1040370,4],[1040576,2,1040577,2],[1040576,3,1040577,3],[1040576,4,1040577,4],[1039955,2,1039956,2],[1039955,3,1039956,3],[1039955,4,1039956,4],[1040162,2,1040163,2],[1040162,3,1040163,3],[1040162,4,1040163,4],[1039541,2,1039542,2],[1039541,3,1039542,3],[1039541,4,1039542,4],[1039748,2,1039749,2],[1039748,3,1039749,3],[1039748,4,1039749,4],[1039127,2,1039128,2],[1039127,3,1039128,3],[1039127,4,1039128,4],[1039334,2,1039335,2],[1039334,3,1039335,3],[1039334,4,1039335,4],[1038713,2,1038714,2],[1038713,3,1038714,3],[1038713,4,1038714,4],[1038920,2,1038921,2],[1038920,3,1038921,3],[1038920,4,1038921,4],[1038299,2,1038300,2],[1038299,3,1038300,3],[1038299,4,1038300,4],[1038506,2,1038507,2],[1038506,3,1038507,3],[1038506,4,1038507,4],[1037885,2,1037886,2],[1037885,3,1037886,3],[1037885,4,1037886,4],[1038092,2,1038093,2],[1038092,3,1038093,3],[1038092,4,1038093,4],[1037471,2,1037472,2],[1037471,3,1037472,3],[1037471,4,1037472,4],[1037678,2,1037679,2],[1037678,3,1037679,3],[1037678,4,1037679,4],[1037057,2,1037058,2],[1037057,3,1037058,3],[1037057,4,1037058,4],[1037264,2,1037265,2],[1037264,3,1037265,3],[1037264,4,1037265,4],[1036643,2,1036644,2],[1036643,3,1036644,3],[1036643,4,1036644,4],[1036850,2,1036851,2],[1036850,3,1036851,3],[1036850,4,1036851,4],[1036229,2,1036230,2],[1036229,3,1036230,3],[1036229,4,1036230,4],[1036436,2,1036437,2],[1036436,3,1036437,3],[1036436,4,1036437,4],[1035815,2,1035816,2],[1035815,3,1035816,3],[1035815,4,1035816,4],[1036022,2,1036023,2],[1036022,3,1036023,3],[1036022,4,1036023,4],[1035401,2,1035402,2],[1035401,3,1035402,3],[1035401,4,1035402,4],[1035608,2,1035609,2],[1035608,3,1035609,3],[1035608,4,1035609,4],[1034987,2,1034988,2],[1034987,3,1034988,3],[1034987,4,1034988,4],[1035194,2,1035195,2],[1035194,3,1035195,3],[1035194,4,1035195,4],[1034573,2,1034574,2],[1034573,3,1034574,3],[1034573,4,1034574,4],[1034780,2,1034781,2],[1034780,3,1034781,3],[1034780,4,1034781,4],[1034159,2,1034160,2],[1034159,3,1034160,3],[1034159,4,1034160,4],[1034366,2,1034367,2],[1034366,3,1034367,3],[1034366,4,1034367,4],[1033745,2,1033746,2],[1033745,3,1033746,3],[1033745,4,1033746,4],[1033952,2,1033953,2],[1033952,3,1033953,3],[1033952,4,1033953,4],[1033331,2,1033332,2],[1033331,3,1033332,3],[1033331,4,1033332,4],[1033538,2,1033539,2],[1033538,3,1033539,3],[1033538,4,1033539,4],[1032917,2,1032918,2],[1032917,3,1032918,3],[1032917,4,1032918,4],[1033124,2,1033125,2],[1033124,3,1033125,3],[1033124,4,1033125,4],[1032503,2,1032504,2],[1032503,3,1032504,3],[1032503,4,1032504,4],[1032710,2,1032711,2],[1032710,3,1032711,3],[1032710,4,1032711,4],[1032089,2,1032090,2],[1032089,3,1032090,3],[1032089,4,1032090,4],[1032296,2,1032297,2],[1032296,3,1032297,3],[1032296,4,1032297,4],[1031675,2,1031676,2],[1031675,3,1031676,3],[1031675,4,1031676,4],[1031882,2,1031883,2],[1031882,3,1031883,3],[1031882,4,1031883,4],[1031261,2,1031262,2],[1031261,3,1031262,3],[1031261,4,1031262,4],[1031468,2,1031469,2],[1031468,3,1031469,3],[1031468,4,1031469,4],[1030847,2,1030848,2],[1030847,3,1030848,3],[1030847,4,1030848,4],[1031054,2,1031055,2],[1031054,3,1031055,3],[1031054,4,1031055,4],[1030433,2,1030434,2],[1030433,3,1030434,3],[1030433,4,1030434,4],[1030640,2,1030641,2],[1030640,3,1030641,3],[1030640,4,1030641,4],[1030019,2,1030020,2],[1030019,3,1030020,3],[1030019,4,1030020,4],[1030226,2,1030227,2],[1030226,3,1030227,3],[1030226,4,1030227,4],[1029605,2,1029606,2],[1029605,3,1029606,3],[1029605,4,1029606,4],[1029812,2,1029813,2],[1029812,3,1029813,3],[1029812,4,1029813,4],[1029191,2,1029192,2],[1029191,3,1029192,3],[1029191,4,1029192,4],[1029398,2,1029399,2],[1029398,3,1029399,3],[1029398,4,1029399,4],[1028777,2,1028778,2],[1028777,3,1028778,3],[1028777,4,1028778,4],[1028984,2,1028985,2],[1028984,3,1028985,3],[1028984,4,1028985,4],[1028363,2,1028364,2],[1028363,3,1028364,3],[1028363,4,1028364,4],[1028570,2,1028571,2],[1028570,3,1028571,3],[1028570,4,1028571,4],[1027949,2,1027950,2],[1027949,3,1027950,3],[1027949,4,1027950,4],[1028156,2,1028157,2],[1028156,3,1028157,3],[1028156,4,1028157,4],[1027535,2,1027536,2],[1027535,3,1027536,3],[1027535,4,1027536,4],[1027742,2,1027743,2],[1027742,3,1027743,3],[1027742,4,1027743,4],[1027121,2,1027122,2],[1027121,3,1027122,3],[1027121,4,1027122,4],[1027328,2,1027329,2],[1027328,3,1027329,3],[1027328,4,1027329,4],[1026707,2,1026708,2],[1026707,3,1026708,3],[1026707,4,1026708,4],[1026914,2,1026915,2],[1026914,3,1026915,3],[1026914,4,1026915,4],[1026293,2,1026294,2],[1026293,3,1026294,3],[1026293,4,1026294,4],[1026500,2,1026501,2],[1026500,3,1026501,3],[1026500,4,1026501,4],[1025879,2,1025880,2],[1025879,3,1025880,3],[1025879,4,1025880,4],[1026086,2,1026087,2],[1026086,3,1026087,3],[1026086,4,1026087,4],[1025465,2,1025466,2],[1025465,3,1025466,3],[1025465,4,1025466,4],[1025672,2,1025673,2],[1025672,3,1025673,3],[1025672,4,1025673,4],[1025051,2,1025052,2],[1025051,3,1025052,3],[1025051,4,1025052,4],[1025258,2,1025259,2],[1025258,3,1025259,3],[1025258,4,1025259,4],[1024637,2,1024638,2],[1024637,3,1024638,3],[1024637,4,1024638,4],[1024844,2,1024845,2],[1024844,3,1024845,3],[1024844,4,1024845,4],[1024223,2,1024224,2],[1024223,3,1024224,3],[1024223,4,1024224,4],[1024430,2,1024431,2],[1024430,3,1024431,3],[1024430,4,1024431,4],[1023809,2,1023810,2],[1023809,3,1023810,3],[1023809,4,1023810,4],[1024016,2,1024017,2],[1024016,3,1024017,3],[1024016,4,1024017,4],[1023395,2,1023396,2],[1023395,3,1023396,3],[1023395,4,1023396,4],[1023602,2,1023603,2],[1023602,3,1023603,3],[1023602,4,1023603,4],[1022981,2,1022982,2],[1022981,3,1022982,3],[1022981,4,1022982,4],[1023188,2,1023189,2],[1023188,3,1023189,3],[1023188,4,1023189,4],[1022567,2,1022568,2],[1022567,3,1022568,3],[1022567,4,1022568,4],[1022774,2,1022775,2],[1022774,3,1022775,3],[1022774,4,1022775,4],[1022153,2,1022154,2],[1022153,3,1022154,3],[1022153,4,1022154,4],[1022360,2,1022361,2],[1022360,3,1022361,3],[1022360,4,1022361,4],[1021739,2,1021740,2],[1021739,3,1021740,3],[1021739,4,1021740,4],[1021946,2,1021947,2],[1021946,3,1021947,3],[1021946,4,1021947,4],[1021325,2,1021326,2],[1021325,3,1021326,3],[1021325,4,1021326,4],[1021532,2,1021533,2],[1021532,3,1021533,3],[1021532,4,1021533,4],[1020911,2,1020912,2],[1020911,3,1020912,3],[1020911,4,1020912,4],[1021118,2,1021119,2],[1021118,3,1021119,3],[1021118,4,1021119,4],[1020497,2,1020498,2],[1020497,3,1020498,3],[1020497,4,1020498,4],[1020704,2,1020705,2],[1020704,3,1020705,3],[1020704,4,1020705,4],[1020083,2,1020084,2],[1020083,3,1020084,3],[1020083,4,1020084,4],[1020290,2,1020291,2],[1020290,3,1020291,3],[1020290,4,1020291,4],[1019669,2,1019670,2],[1019669,3,1019670,3],[1019669,4,1019670,4],[1019876,2,1019877,2],[1019876,3,1019877,3],[1019876,4,1019877,4],[1019255,2,1019256,2],[1019255,3,1019256,3],[1019255,4,1019256,4],[1019462,2,1019463,2],[1019462,3,1019463,3],[1019462,4,1019463,4],[1018841,2,1018842,2],[1018841,3,1018842,3],[1018841,4,1018842,4],[1019048,2,1019049,2],[1019048,3,1019049,3],[1019048,4,1019049,4],[1018427,2,1018428,2],[1018427,3,1018428,3],[1018427,4,1018428,4],[1018634,2,1018635,2],[1018634,3,1018635,3],[1018634,4,1018635,4],[1018013,2,1018014,2],[1018013,3,1018014,3],[1018013,4,1018014,4],[1018220,2,1018221,2],[1018220,3,1018221,3],[1018220,4,1018221,4],[1017599,2,1017600,2],[1017599,3,1017600,3],[1017599,4,1017600,4],[1017806,2,1017807,2],[1017806,3,1017807,3],[1017806,4,1017807,4],[1017185,2,1017186,2],[1017185,3,1017186,3],[1017185,4,1017186,4],[1017392,2,1017393,2],[1017392,3,1017393,3],[1017392,4,1017393,4],[1016771,2,1016772,2],[1016771,3,1016772,3],[1016771,4,1016772,4],[1016978,2,1016979,2],[1016978,3,1016979,3],[1016978,4,1016979,4],[1016357,2,1016358,2],[1016357,3,1016358,3],[1016357,4,1016358,4],[1016564,2,1016565,2],[1016564,3,1016565,3],[1016564,4,1016565,4],[1015943,2,1015944,2],[1015943,3,1015944,3],[1015943,4,1015944,4],[1016150,2,1016151,2],[1016150,3,1016151,3],[1016150,4,1016151,4],[1015529,2,1015530,2],[1015529,3,1015530,3],[1015529,4,1015530,4],[1015736,2,1015737,2],[1015736,3,1015737,3],[1015736,4,1015737,4],[1015115,2,1015116,2],[1015115,3,1015116,3],[1015115,4,1015116,4],[1015322,2,1015323,2],[1015322,3,1015323,3],[1015322,4,1015323,4],[1014701,2,1014702,2],[1014701,3,1014702,3],[1014701,4,1014702,4],[1014908,2,1014909,2],[1014908,3,1014909,3],[1014908,4,1014909,4],[1014287,2,1014288,2],[1014287,3,1014288,3],[1014287,4,1014288,4],[1014494,2,1014495,2],[1014494,3,1014495,3],[1014494,4,1014495,4],[1013873,2,1013874,2],[1013873,3,1013874,3],[1013873,4,1013874,4],[1014080,2,1014081,2],[1014080,3,1014081,3],[1014080,4,1014081,4],[1013459,2,1013460,2],[1013459,3,1013460,3],[1013459,4,1013460,4],[1013666,2,1013667,2],[1013666,3,1013667,3],[1013666,4,1013667,4],[1013045,2,1013046,2],[1013045,3,1013046,3],[1013045,4,1013046,4],[1013252,2,1013253,2],[1013252,3,1013253,3],[1013252,4,1013253,4],[1012631,2,1012632,2],[1012631,3,1012632,3],[1012631,4,1012632,4],[1012838,2,1012839,2],[1012838,3,1012839,3],[1012838,4,1012839,4],[1012217,2,1012218,2],[1012217,3,1012218,3],[1012217,4,1012218,4],[1012424,2,1012425,2],[1012424,3,1012425,3],[1012424,4,1012425,4],[1011803,2,1011804,2],[1011803,3,1011804,3],[1011803,4,1011804,4],[1012010,2,1012011,2],[1012010,3,1012011,3],[1012010,4,1012011,4],[1011389,2,1011390,2],[1011389,3,1011390,3],[1011389,4,1011390,4],[1011596,2,1011597,2],[1011596,3,1011597,3],[1011596,4,1011597,4],[1010975,2,1010976,2],[1010975,3,1010976,3],[1010975,4,1010976,4],[1011182,2,1011183,2],[1011182,3,1011183,3],[1011182,4,1011183,4],[1010561,2,1010562,2],[1010561,3,1010562,3],[1010561,4,1010562,4],[1010768,2,1010769,2],[1010768,3,1010769,3],[1010768,4,1010769,4],[1010147,2,1010148,2],[1010147,3,1010148,3],[1010147,4,1010148,4],[1010354,2,1010355,2],[1010354,3,1010355,3],[1010354,4,1010355,4],[1009733,2,1009734,2],[1009733,3,1009734,3],[1009733,4,1009734,4],[1009940,2,1009941,2],[1009940,3,1009941,3],[1009940,4,1009941,4],[1009319,2,1009320,2],[1009319,3,1009320,3],[1009319,4,1009320,4],[1009526,2,1009527,2],[1009526,3,1009527,3],[1009526,4,1009527,4],[1008905,2,1008906,2],[1008905,3,1008906,3],[1008905,4,1008906,4],[1009112,2,1009113,2],[1009112,3,1009113,3],[1009112,4,1009113,4],[1008491,2,1008492,2],[1008491,3,1008492,3],[1008491,4,1008492,4],[1008698,2,1008699,2],[1008698,3,1008699,3],[1008698,4,1008699,4],[1008077,2,1008078,2],[1008077,3,1008078,3],[1008077,4,1008078,4],[1008284,2,1008285,2],[1008284,3,1008285,3],[1008284,4,1008285,4],[1007663,2,1007664,2],[1007663,3,1007664,3],[1007663,4,1007664,4],[1007870,2,1007871,2],[1007870,3,1007871,3],[1007870,4,1007871,4],[1007249,2,1007250,2],[1007249,3,1007250,3],[1007249,4,1007250,4],[1007456,2,1007457,2],[1007456,3,1007457,3],[1007456,4,1007457,4],[1006835,2,1006836,2],[1006835,3,1006836,3],[1006835,4,1006836,4],[1007042,2,1007043,2],[1007042,3,1007043,3],[1007042,4,1007043,4],[1006421,2,1006422,2],[1006421,3,1006422,3],[1006421,4,1006422,4],[1006628,2,1006629,2],[1006628,3,1006629,3],[1006628,4,1006629,4],[1006007,2,1006008,2],[1006007,3,1006008,3],[1006007,4,1006008,4],[1006214,2,1006215,2],[1006214,3,1006215,3],[1006214,4,1006215,4],[1005593,2,1005594,2],[1005593,3,1005594,3],[1005593,4,1005594,4],[1005800,2,1005801,2],[1005800,3,1005801,3],[1005800,4,1005801,4],[1005179,2,1005180,2],[1005179,3,1005180,3],[1005179,4,1005180,4],[1005386,2,1005387,2],[1005386,3,1005387,3],[1005386,4,1005387,4],[1004765,2,1004766,2],[1004765,3,1004766,3],[1004765,4,1004766,4],[1004972,2,1004973,2],[1004972,3,1004973,3],[1004972,4,1004973,4],[1004351,2,1004352,2],[1004351,3,1004352,3],[1004351,4,1004352,4],[1004558,2,1004559,2],[1004558,3,1004559,3],[1004558,4,1004559,4],[1003937,2,1003938,2],[1003937,3,1003938,3],[1003937,4,1003938,4],[1004144,2,1004145,2],[1004144,3,1004145,3],[1004144,4,1004145,4],[1003523,2,1003524,2],[1003523,3,1003524,3],[1003523,4,1003524,4],[1003730,2,1003731,2],[1003730,3,1003731,3],[1003730,4,1003731,4],[1003109,2,1003110,2],[1003109,3,1003110,3],[1003109,4,1003110,4],[1003316,2,1003317,2],[1003316,3,1003317,3],[1003316,4,1003317,4],[1002695,2,1002696,2],[1002695,3,1002696,3],[1002695,4,1002696,4],[1002902,2,1002903,2],[1002902,3,1002903,3],[1002902,4,1002903,4],[1002281,2,1002282,2],[1002281,3,1002282,3],[1002281,4,1002282,4],[1002488,2,1002489,2],[1002488,3,1002489,3],[1002488,4,1002489,4],[1001867,2,1001868,2],[1001867,3,1001868,3],[1001867,4,1001868,4],[1002074,2,1002075,2],[1002074,3,1002075,3],[1002074,4,1002075,4],[1001453,2,1001454,2],[1001453,3,1001454,3],[1001453,4,1001454,4],[1001660,2,1001661,2],[1001660,3,1001661,3],[1001660,4,1001661,4],[1001039,2,1001040,2],[1001039,3,1001040,3],[1001039,4,1001040,4],[1001246,2,1001247,2],[1001246,3,1001247,3],[1001246,4,1001247,4],[1000625,2,1000626,2],[1000625,3,1000626,3],[1000625,4,1000626,4],[1000832,2,1000833,2],[1000832,3,1000833,3],[1000832,4,1000833,4],[1000211,2,1000212,2],[1000211,3,1000212,3],[1000211,4,1000212,4],[1000418,2,1000419,2],[1000418,3,1000419,3],[1000418,4,1000419,4],[999797,2,999798,2],[999797,3,999798,3],[999797,4,999798,4],[1000004,2,1000005,2],[1000004,3,1000005,3],[1000004,4,1000005,4],[999383,2,999384,2],[999383,3,999384,3],[999383,4,999384,4],[999590,2,999591,2],[999590,3,999591,3],[999590,4,999591,4],[998969,2,998970,2],[998969,3,998970,3],[998969,4,998970,4],[999176,2,999177,2],[999176,3,999177,3],[999176,4,999177,4],[998555,2,998556,2],[998555,3,998556,3],[998555,4,998556,4],[998762,2,998763,2],[998762,3,998763,3],[998762,4,998763,4],[998141,2,998142,2],[998141,3,998142,3],[998141,4,998142,4],[998348,2,998349,2],[998348,3,998349,3],[998348,4,998349,4],[997727,2,997728,2],[997727,3,997728,3],[997727,4,997728,4],[997934,2,997935,2],[997934,3,997935,3],[997934,4,997935,4],[997313,2,997314,2],[997313,3,997314,3],[997313,4,997314,4],[997520,2,997521,2],[997520,3,997521,3],[997520,4,997521,4],[996899,2,996900,2],[996899,3,996900,3],[996899,4,996900,4],[997106,2,997107,2],[997106,3,997107,3],[997106,4,997107,4],[996485,2,996486,2],[996485,3,996486,3],[996485,4,996486,4],[996692,2,996693,2],[996692,3,996693,3],[996692,4,996693,4],[996071,2,996072,2],[996071,3,996072,3],[996071,4,996072,4],[996278,2,996279,2],[996278,3,996279,3],[996278,4,996279,4],[995657,2,995658,2],[995657,3,995658,3],[995657,4,995658,4],[995864,2,995865,2],[995864,3,995865,3],[995864,4,995865,4],[995243,2,995244,2],[995243,3,995244,3],[995243,4,995244,4],[995450,2,995451,2],[995450,3,995451,3],[995450,4,995451,4],[994829,2,994830,2],[994829,3,994830,3],[994829,4,994830,4],[995036,2,995037,2],[995036,3,995037,3],[995036,4,995037,4],[994415,2,994416,2],[994415,3,994416,3],[994415,4,994416,4],[994622,2,994623,2],[994622,3,994623,3],[994622,4,994623,4],[994001,2,994002,2],[994001,3,994002,3],[994001,4,994002,4],[994208,2,994209,2],[994208,3,994209,3],[994208,4,994209,4],[993587,2,993588,2],[993587,3,993588,3],[993587,4,993588,4],[993794,2,993795,2],[993794,3,993795,3],[993794,4,993795,4],[993173,2,993174,2],[993173,3,993174,3],[993173,4,993174,4],[993380,2,993381,2],[993380,3,993381,3],[993380,4,993381,4],[992759,2,992760,2],[992759,3,992760,3],[992759,4,992760,4],[992966,2,992967,2],[992966,3,992967,3],[992966,4,992967,4],[992345,2,992346,2],[992345,3,992346,3],[992345,4,992346,4],[992552,2,992553,2],[992552,3,992553,3],[992552,4,992553,4],[991931,2,991932,2],[991931,3,991932,3],[991931,4,991932,4],[992138,2,992139,2],[992138,3,992139,3],[992138,4,992139,4],[991517,2,991518,2],[991517,3,991518,3],[991517,4,991518,4],[991724,2,991725,2],[991724,3,991725,3],[991724,4,991725,4],[991103,2,991104,2],[991103,3,991104,3],[991103,4,991104,4],[991310,2,991311,2],[991310,3,991311,3],[991310,4,991311,4],[990689,2,990690,2],[990689,3,990690,3],[990689,4,990690,4],[990896,2,990897,2],[990896,3,990897,3],[990896,4,990897,4],[990275,2,990276,2],[990275,3,990276,3],[990275,4,990276,4],[990482,2,990483,2],[990482,3,990483,3],[990482,4,990483,4],[989861,2,989862,2],[989861,3,989862,3],[989861,4,989862,4],[990068,2,990069,2],[990068,3,990069,3],[990068,4,990069,4],[989447,2,989448,2],[989447,3,989448,3],[989447,4,989448,4],[989654,2,989655,2],[989654,3,989655,3],[989654,4,989655,4],[989033,2,989034,2],[989033,3,989034,3],[989033,4,989034,4],[989240,2,989241,2],[989240,3,989241,3],[989240,4,989241,4],[988619,2,988620,2],[988619,3,988620,3],[988619,4,988620,4],[988826,2,988827,2],[988826,3,988827,3],[988826,4,988827,4],[988205,2,988206,2],[988205,3,988206,3],[988205,4,988206,4],[988412,2,988413,2],[988412,3,988413,3],[988412,4,988413,4],[987791,2,987792,2],[987791,3,987792,3],[987791,4,987792,4],[987998,2,987999,2],[987998,3,987999,3],[987998,4,987999,4],[987377,2,987378,2],[987377,3,987378,3],[987377,4,987378,4],[987584,2,987585,2],[987584,3,987585,3],[987584,4,987585,4],[986963,2,986964,2],[986963,3,986964,3],[986963,4,986964,4],[987170,2,987171,2],[987170,3,987171,3],[987170,4,987171,4],[986549,2,986550,2],[986549,3,986550,3],[986549,4,986550,4],[986756,2,986757,2],[986756,3,986757,3],[986756,4,986757,4],[986135,2,986136,2],[986135,3,986136,3],[986135,4,986136,4],[986342,2,986343,2],[986342,3,986343,3],[986342,4,986343,4],[985721,2,985722,2],[985721,3,985722,3],[985721,4,985722,4],[985928,2,985929,2],[985928,3,985929,3],[985928,4,985929,4],[985307,2,985308,2],[985307,3,985308,3],[985307,4,985308,4],[985514,2,985515,2],[985514,3,985515,3],[985514,4,985515,4],[984893,2,984894,2],[984893,3,984894,3],[984893,4,984894,4],[985100,2,985101,2],[985100,3,985101,3],[985100,4,985101,4],[984479,2,984480,2],[984479,3,984480,3],[984479,4,984480,4],[984686,2,984687,2],[984686,3,984687,3],[984686,4,984687,4],[984065,2,984066,2],[984065,3,984066,3],[984065,4,984066,4],[984272,2,984273,2],[984272,3,984273,3],[984272,4,984273,4],[983651,2,983652,2],[983651,3,983652,3],[983651,4,983652,4],[983858,2,983859,2],[983858,3,983859,3],[983858,4,983859,4],[983237,2,983238,2],[983237,3,983238,3],[983237,4,983238,4],[983444,2,983445,2],[983444,3,983445,3],[983444,4,983445,4],[982823,2,982824,2],[982823,3,982824,3],[982823,4,982824,4],[983030,2,983031,2],[983030,3,983031,3],[983030,4,983031,4],[982409,2,982410,2],[982409,3,982410,3],[982409,4,982410,4],[982616,2,982617,2],[982616,3,982617,3],[982616,4,982617,4],[981995,2,981996,2],[981995,3,981996,3],[981995,4,981996,4],[982202,2,982203,2],[982202,3,982203,3],[982202,4,982203,4],[981581,2,981582,2],[981581,3,981582,3],[981581,4,981582,4],[981788,2,981789,2],[981788,3,981789,3],[981788,4,981789,4],[981167,2,981168,2],[981167,3,981168,3],[981167,4,981168,4],[981374,2,981375,2],[981374,3,981375,3],[981374,4,981375,4],[980753,2,980754,2],[980753,3,980754,3],[980753,4,980754,4],[980960,2,980961,2],[980960,3,980961,3],[980960,4,980961,4],[980339,2,980340,2],[980339,3,980340,3],[980339,4,980340,4],[980546,2,980547,2],[980546,3,980547,3],[980546,4,980547,4],[979925,2,979926,2],[979925,3,979926,3],[979925,4,979926,4],[980132,2,980133,2],[980132,3,980133,3],[980132,4,980133,4],[979511,2,979512,2],[979511,3,979512,3],[979511,4,979512,4],[979718,2,979719,2]],"merged_total":15181,"flags":["merged_cut"]}
[null,"Genanskaffelsespriser","Måleenhed","Vægtet \nenhedspris","Teknisk levetid"]
[]
[null,"Produktionsanlæg:"]
[null,"Boringer"]
[null,"Boring (inkl. etablering, forerør, filter og prøvepumpning)","kr./m.",2538,30]
[null,"Råvandsstationer"]
[null,"Råvandsstation komplet montering og boringshus/tørbrønd","kr./stk.",{"$f":"57810*(1+D203)","v":59948.969999999994},30]
[null,"Instrumenter (flowmåler+tryk transducer+alarmer)","kr./stk.",{"$f":"65241*(1+D203)","v":67654.917000000001},10]
[null,"Pumpe inkl. stigrør og forerørsforsejlinger mv.","kr/m³/h ","Variabel",15]
[null,"Erstatninger (OBS ingen øst-tillæg eller øvrige tillæg) ","kr/stk",44911,30]
[null,"Hegn","kr./stk.",{"$f":"85428*(1+D203)","v":88588.835999999996},15]
[null,"Elanlæg","kr./boring",{"$f":"108657*(1+D203)","v":112677.30899999999},20]
[null,"SRO anlæg","kr./boring",{"$f":"29256*(1+D203)","v":30338.471999999998},10]
[null,"Råvandsledninger - Land"]
[null,"Ø 50mm < Ledningsnet ≤ Ø110 mm","kr./m.",{"$f":"354*(1+D203)","v":367.09799999999996},75]
[null,"Ø110 mm < Ledningsnet ≤ Ø 250 mm","kr./m.",{"$f":"1018*(1+D203)","v":1055.6659999999999},75]
[null,"Ø 250 mm < Ledningsnet ≤ Ø 500mm","kr./m.",{"$f":"2335*(1+D203)","v":2421.395},75]
[null,"Ledningsnet > Ø 500 mm","kr./m.",{"$f":"5029*(1+D203)","v":5215.0729999999994},75]
[null,"Råvandsledninger - By"]
[null,"Ø 50mm < Ledningsnet ≤ Ø110 mm","kr./m.",{"$f":"958*(1+D203)","v":993.44599999999991},75]
[null,"Ø110 mm < Ledningsnet ≤ Ø 250 mm","kr./m.",{"$f":"1684*(1+D203)","v":1746.3079999999998},75]
[null,"Ø 250 mm < Ledningsnet ≤ Ø 500mm","kr./m.",{"$f":"3153*(1+D203)","v":3269.6609999999996},75]
[null,"Ledningsnet > Ø 500 mm","kr./m.",{"$f":"5998*(1+D203)","v":6219.9259999999995},75]
[null,"Råvandsledninger - City"]
[null,"Ø 50mm < Ledningsnet ≤ Ø110 mm","kr./m.",{"$f":"1495*(1+D203)","v":1550.3149999999998},75]
[null,"Ø110 mm < Ledningsnet ≤ Ø 250 mm","kr./m.",{"$f":"2192*(1+D203)","v":2273.1039999999998},75]
[null,"Ø 250 mm < Ledningsnet ≤ Ø 500mm","kr./m.",{"$f":"3773*(1+D203)","v":3912.6009999999997},75]
[null,"Ledningsnet > Ø 500 mm","kr./m.",{"$f":"6732*(1+D203)","v":6981.0839999999998},75]
[null,"Vandværker: Behandling og Udpumpning"]
[null,"Beluftningsanlæg, iltningstrappe, Konstruktioner","kr/m³/h ","Variabel",50]
[null,"Beluftningsanlæg, iltningstrappe, Mek./EL","kr/m³/h ","Variabel",25]
[null,"Beluftningsanlæg, ika-beluftning, Konstruktioner","kr/m³/h ","Variabel",50]
[null,"Beluftningsanlæg, ika-beluftning, Mek./EL","kr/m³/h ","Variabel",25]
[null,"Beluftningsanlæg, bundbeluftbning, Konstruktioner","kr/m³/h ","Variabel",50]
[null,"Beluftningsanlæg, bundbeluftbning, Mek./EL","kr/m³/h ","Variabel",25]
[null,"Beluftningsanlæg, rislebakke, Konstruktioner","kr/m³/h ","Variabel",50]
[null,"Beluftningsanlæg, rislebakke, Mek./EL","kr/m³/h ","Variabel",25]
[null,"Beluftningsanlæg, kompressorbeluftning","kr/m³/h ","Variabel",25]
[null,"Beluftningsanlæg, ren ilt","kr/m³/h ","Variabel",25]
[null,"Behandlingsanlæg, kalk anlæg","kr/m³/h ","Variabel",25]
[null,"Behandlingsanlæg, luddosering","kr/m³/h ","Variabel",25]
[null,"Filteranlæg, åbne filtre, enkelt filtrering, Konstruktioner","kr/m³/h ","Variabel",50]
[null,"Filteranlæg, åbne filtre, enkelt filtrering, Mek./EL","kr/m³/h ","Variabel",25]
[null,"Filteranlæg, åbne filtre, dobbelt filtrering, Konstruktioner","kr/m³/h ","Variabel",50]
[null,"Filteranlæg, åbne filtre, dobbelt filtrering, Mek./EL","kr/m³/h ","Variabel",25]
[null,"Filteranlæg, trykfiltre, enkelt filtrering","kr/m³/h ","Variabel",25]
[null,"Filteranlæg, trykfiltre, dobbelt filtrering","kr/m³/h ","Variabel",25]
[null,"Rentvandsbeholder  insitu støbt","kr/m³","Variabel",50]
[null,"Rentvandsbeholder  element","kr/m³","Variabel",50]
[null,"Udpumpningsanlæg, rentvandspumper på vandværk","kr/m³/h ","Variabel",25]
[null,"Udpumpningsanlæg, Frekvensomformer","kr/kW","Variabel",25]
[null,"Udpumpningsanlæg, Hydrofor","kr/lilter","Variabel",25]
[null,"Skyllevand-/slamhåndteringsanlæg - lukkede betonbeholdere","kr/m³","Variabel",50]
[null,"Skyllevand-/slamhåndteringsanl. - åbne med faste sider/bund","kr/m³","Variabel",50]
[null,"Skyllevand-/slamhåndteringsanlæg - jordbassiner","kr/m³","Variabel",50]
[null,"Skyllevandsbehandling, inkl. UV-filter mv., Mek./EL","kr/m³/h ","Variabel",25]
[null,"Skyllevandsbehandling, inkl. UV-filter mv., SRO","kr/m³/h ","Variabel",10]
[null,"Nødstrømsanlæg på vandværk","kr/kW","Variabel",25]
[null,"Elanlæg og SRO-anlæg - vandværk, Elanlæg","kr./m³/h","Variabel",25]
[null,"Elanlæg og SRO-anlæg - vandværk, SRO","kr./m³/h","Variabel",10]
[null,"Bygninger"]
[null,"Etageareal vandbehandlingsbygning","kr/m²",{"$f":"18108*(1+D203)","v":18777.995999999999},75]
[null,"Etageareal kontor og mandskabsfaciliteter","kr/m²",{"$f":"19309*(1+D203)","v":20023.432999999997},75]
[null,"Værksted","kr/m²",{"$f":"14921*(1+D203)","v":15473.076999999999},75]
[null,"Lager","kr/m²",{"$f":"14921*(1+D203)","v":15473.076999999999},75]
[null,"Garage og rørlager","kr/m²",{"$f":"10444*(1+D203)","v":10830.428},75]
[null,"Bygning for trykforøgere","kr/m²",{"$f":"20318*(1+D203)","v":21069.766},75]
[null,"Laboratorium (bygning, inkl. inventar+udstyr), Konstruktioner","kr/m²",{"$f":"20362*(1+D203)","v":21115.393999999997},75]
[null,"Laboratorium (bygning, inkl. inventar+udstyr), Mek./EL","kr/m²",{"$f":"13575*(1+D203)","v":14077.275},10]
[null,"Andre"]
[null,"Sikring (terror, hærværk), Mek./EL","kr./stk.",{"$f":"6372*(1+D203)","v":6607.7639999999992},25]
[null,"Sikring (terror, hærværk), SRO","kr./stk.",{"$f":"14868*(1+D203)","v":15418.115999999998},10]
[null,"Sikring, mindre avanceret (hegn, porte), Mek./EL","kr./stk.",{"$f":"26067*(1+D203)","v":27031.478999999999},25]
[null,"Sikring, mindre avanceret (hegn, porte), SRO","kr./stk.",{"$f":"60823*(1+D203)","v":63073.450999999994},10]
[null,"Sikring, avanceret (hegn, porte og overvågningssystemer), Mek./EL","kr./stk.",{"$f":"56318*(1+D203)","v":58401.765999999996},25]
[null,"Sikring, avanceret (hegn, porte og overvågningssystemer), SRO","kr./stk.",{"$f":"225271*(1+D203)","v":233606.02699999997},10]
[]
[]
[null,"Distributionsanlæg:"]
[null,"Ledningsnet - Land"]
[null,"Ledningsnet ≤ Ø50 mm","kr./m.",{"$f":"529*(1+D203)","v":548.57299999999998},75]
[null,"Ø 50mm < Ledningsnet ≤ Ø110 mm","kr./m.",{"$f":"808*(1+D203)","v":837.89599999999996},75]
[null,"Ø110 mm < Ledningsnet ≤ Ø 250 mm","kr./m.",{"$f":"1513*(1+D203)","v":1568.981},75]
[null,"Ø 250 mm < Ledningsnet ≤ Ø 500mm","kr./m.",{"$f":"2944*(1+D203)","v":3052.9279999999999},75]
[null,"Ledningsnet > Ø 500 mm","kr./m.",{"$f":"5751*(1+D203)","v":5963.7869999999994},75]
[null,"Støbejernsledninger ≤ Ø50 mm","kr./m.",{"$f":"899*(1+D203)","v":932.26299999999992},100]
[null,"Støbejernsledninger Ø 50mm < Ledningsnet ≤ Ø110 mm","kr./m.",{"$f":"1053*(1+D203)","v":1091.961},100]
[null,"Støbejernsledninger Ø110 mm < Ledningsnet ≤ Ø 250 mm","kr./m.",{"$f":"1490*(1+D203)","v":1545.1299999999999},100]
[null,"Støbejernsledninger Ø 250 mm < Ledningsnet ≤ Ø 500mm","kr./m.",{"$f":"2762*(1+D203)","v":2864.194},100]
[null,"Støbejernsledninger Ledningsnet > Ø 500 mm","kr./m.",{"$f":"5484*(1+D203)","v":5686.9079999999994},100]
[null,"Eternitledninger ≤ Ø50 mm","kr./m.",{"$f":"655*(1+D203)","v":679.2349999999999},75]
[null,"Eternitledninger Ø 50mm < Ledningsnet ≤ Ø110 mm","kr./m.",{"$f":"885*(1+D203)","v":917.74499999999989},75]
[null,"Eternitledninger Ø110 mm < Ledningsnet ≤ Ø 250 mm","kr./m.",{"$f":"1287*(1+D203)","v":1334.6189999999999},75]
[null,"Eternitledninger Ø 250 mm < Ledningsnet ≤ Ø 500mm","kr./m.",{"$f":"3056*(1+D203)","v":3169.0719999999997},75]
[null,"Eternitledninger Ledningsnet > Ø 500 mm","kr./m.",{"$f":"8477*(1+D203)","v":8790.6489999999994},75]
[null,"Skelbrønd, Konstruktioner","kr./stk.",{"$f":"10415*(1+D203)","v":10800.355},50]
[null,"Skelbrønd, Mek./EL","kr./stk.",{"$f":"15623*(1+D203)","v":16201.050999999999},15]
[null,"Inspektionsbrønd, Konstruktioner","kr./stk.",{"$f":"10415*(1+D203)","v":10800.355},50]
[null,"Inspektionsbrønd, Mek./EL","kr./stk.",{"$f":"13019*(1+D203)","v":13500.703},15]
[null,"Stik på ledningsnet, Konstruktioner","kr./stk.",{"$f":"4722*(1+D203)","v":4896.7139999999999},75]
[null,"Stik på ledningsnet, Mek./EL","kr./stk.",{"$f":"4722*(1+D203)","v":4896.7139999999999},75]
[null,"Ledningsnet - By"]
[null,"Ledningsnet ≤ Ø50 mm","kr./m.",{"$f":"650*(1+D203)","v":674.05},75]
[null,"Ø 50mm < Ledningsnet ≤ Ø110 mm","kr./m.",{"$f":"958*(1+D203)","v":993.44599999999991},75]
[null,"Ø110 mm < Ledningsnet ≤ Ø 250 mm","kr./m.",{"$f":"1684*(1+D203)","v":1746.3079999999998},75]
[null,"Ø 250 mm < Ledningsnet ≤ Ø 500mm","kr./m.",{"$f":"3153*(1+D203)","v":3269.6609999999996},75]
[null,"Ledningsnet > Ø 500 mm","kr./m.",{"$f":"5998*(1+D203)","v":6219.9259999999995},75]
[null,"Støbejernsledninger ≤ Ø50 mm","kr./m.",{"$f":"1020*(1+D203)","v":1057.74},100]
[null,"Støbejernsledninger Ø 50mm < Ledningsnet ≤ Ø110 mm","kr./m.",{"$f":"1203*(1+D203)","v":1247.511},100]
[null,"Støbejernsledninger Ø110 mm < Ledningsnet ≤ Ø 250 mm","kr./m.",{"$f":"1661*(1+D203)","v":1722.4569999999999},100]
[null,"Støbejernsledninger Ø 250 mm < Ledningsnet ≤ Ø 500mm","kr./m.",{"$f":"2971*(1+D203)","v":3080.9269999999997},100]
[null,"Støbejernsledninger Ledningsnet > Ø 500 mm","kr./m.",{"$f":"5731*(1+D203)","v":5943.0469999999996},100]
[null,"Eternitledninger ≤ Ø50 mm","kr./m.",{"$f":"776*(1+D203)","v":804.71199999999999},75]
[null,"Eternitledninger Ø 50mm < Ledningsnet ≤ Ø110 mm","kr./m.",{"$f":"1035*(1+D203)","v":1073.2949999999998},75]
[null,"Eternitledninger Ø110 mm < Ledningsnet ≤ Ø 250 mm","kr./m.",{"$f":"1456*(1+D203)","v":1509.8719999999998},75]
[null,"Eternitledninger Ø 250 mm < Ledningsnet ≤ Ø 500mm","kr./m.",{"$f":"3265*(1+D203)","v":3385.8049999999998},75]
[null,"Eternitledninger Ledningsnet > Ø 500 mm","kr./m.",{"$f":"8724*(1+D203)","v":9046.7879999999986},75]
[null,"Skelbrønd, Konstruktioner","kr./stk.",{"$f":"11457*(1+D203)","v":11880.909},50]
[null,"Skelbrønd, Mek./EL","kr./stk.",{"$f":"17185*(1+D203)","v":17820.844999999998},15]
[null,"Inspektionsbrønd, Konstruktioner","kr./stk.",{"$f":"11457*(1+D203)","v":11880.909},50]
[null,"Inspektionsbrønd, Mek./EL","kr./stk.",{"$f":"14321*(1+D203)","v":14850.876999999999},15]
[null,"Stik på ledningsnet, Konstruktioner","kr./stk.",{"$f":"5666*(1+D203)","v":5875.6419999999998},75]
[null,"Stik på ledningsnet, Mek./EL","kr./stk.",{"$f":"5666*(1+D203)","v":5875.6419999999998},75]
[null,"Ledningsnet - City"]
[null,"Ledningsnet ≤ Ø50 mm","kr./m.",{"$f":"1078*(1+D203)","v":1117.886},75]
[null,"Ø 50mm < Ledningsnet ≤ Ø110 mm","kr./m.",{"$f":"1495*(1+D203)","v":1550.3149999999998},75]
[null,"Ø110 mm < Ledningsnet ≤ Ø 250 mm","kr./m.",{"$f":"2192*(1+D203)","v":2273.1039999999998},75]
[null,"Ø 250 mm < Ledningsnet ≤ Ø 500mm","kr./m.",{"$f":"3773*(1+D203)","v":3912.6009999999997},75]
[null,"Ledningsnet > Ø 500 mm","kr./m.",{"$f":"6732*(1+D203)","v":6981.0839999999998},75]
[null,"Støbejernsledninger ≤ Ø50 mm","kr./m.",{"$f":"1448*(1+D203)","v":1501.5759999999998},100]
[null,"Støbejernsledninger Ø 50mm < Ledningsnet ≤ Ø110 mm","kr./m.",{"$f":"1740*(1+D203)","v":1804.3799999999999},100]
[null,"Støbejernsledninger Ø110 mm < Ledningsnet ≤ Ø 250 mm","kr./m.",{"$f":"2169*(1+D203)","v":2249.2529999999997},100]
[null,"Støbejernsledninger Ø 250 mm < Ledningsnet ≤ Ø 500mm","kr./m.",{"$f":"3591*(1+D203)","v":3723.8669999999997},100]
[null,"Støbejernsledninger Ledningsnet > Ø 500 mm","kr./m.",{"$f":"6465*(1+D203)","v":6704.2049999999999},100]
[null,"Eternitledninger ≤ Ø50 mm","kr./m.",{"$f":"1204*(1+D203)","v":1248.548},75]
[null,"Eternitledninger Ø 50mm < Ledningsnet ≤ Ø110 mm","kr./m.",{"$f":"1572*(1+D203)","v":1630.164},75]
[null,"Eternitledninger Ø110 mm < Ledningsnet ≤ Ø 250 mm","kr./m.",{"$f":"1966*(1+D203)","v":2038.7419999999997},75]
[null,"Eternitledninger Ø 250 mm < Ledningsnet ≤ Ø 500mm","kr./m.",{"$f":"3885*(1+D203)","v":4028.7449999999999},75]
[null,"Eternitledninger Ledningsnet > Ø 500 mm","kr./m.",{"$f":"9458*(1+D203)","v":9807.9459999999999},75]
[null,"Skelbrønd, Konstruktioner","kr./stk.",{"$f":"12498*(1+D203)","v":12960.425999999999},50]
[null,"Skelbrønd, Mek./EL","kr./stk.",{"$f":"18747*(1+D203)","v":19440.638999999999},15]
[null,"Inspektionsbrønd, Konstruktioner","kr./stk.",{"$f":"12498*(1+D203)","v":12960.425999999999},50]
[null,"Inspektionsbrønd, Mek./EL","kr./stk.",{"$f":"15623*(1+D203)","v":16201.050999999999},15]
[null,"Stik på ledningsnet, Konstruktioner","kr./stk.",{"$f":"6139*(1+D203)","v":6366.1429999999991},75]
[null,"Stik på ledningsnet, Mek./EL","kr./stk.",{"$f":"6139*(1+D203)","v":6366.1429999999991},75]
[null,"Ledningsnet - Indre city"]
[null,"Ledningsnet ≤ Ø50 mm","kr./m.",{"$f":"1697*(1+D203)","v":1759.7889999999998},75]
[null,"Ø 50mm < Ledningsnet ≤ Ø110 mm","kr./m.",{"$f":"2268*(1+D203)","v":2351.9159999999997},75]
[null,"Ø110 mm < Ledningsnet ≤ Ø 250 mm","kr./m.",{"$f":"3009*(1+D203)","v":3120.3329999999996},75]
[null,"Ø 250 mm < Ledningsnet ≤ Ø 500mm","kr./m.",{"$f":"4773*(1+D203)","v":4949.6009999999997},75]
[null,"Ledningsnet > Ø 500 mm","kr./m.",{"$f":"7915*(1+D203)","v":8207.8549999999996},75]
[null,"Støbejernsledninger ≤ Ø50 mm","kr./m.",{"$f":"2067*(1+D203)","v":2143.4789999999998},100]
[null,"Støbejernsledninger Ø 50mm < Ledningsnet ≤ Ø110 mm","kr./m.",{"$f":"2513*(1+D203)","v":2605.9809999999998},100]
[null,"Støbejernsledninger Ø110 mm < Ledningsnet ≤ Ø 250 mm","kr./m.",{"$f":"2986*(1+D203)","v":3096.482},100]
[null,"Støbejernsledninger Ø 250 mm < Ledningsnet ≤ Ø 500mm","kr./m.",{"$f":"4591*(1+D203)","v":4760.8669999999993},100]
[null,"Støbejernsledninger Ledningsnet > Ø 500 mm","kr./m.",{"$f":"7648*(1+D203)","v":7930.9759999999997},100]
[null,"Eternitledninger ≤ Ø50 mm","kr./m.",{"$f":"1823*(1+D203)","v":1890.4509999999998},75]
[null,"Eternitledninger Ø 50mm < Ledningsnet ≤ Ø110 mm","kr./m.",{"$f":"2345*(1+D203)","v":2431.7649999999999},75]
[null,"Eternitledninger Ø110 mm < Ledningsnet ≤ Ø 250 mm","kr./m.",{"$f":"2783*(1+D203)","v":2885.971},75]
[null,"Eternitledninger Ø 250 mm < Ledningsnet ≤ Ø 500mm","kr./m.",{"$f":"4885*(1+D203)","v":5065.7449999999999},75]
[null,"Eternitledninger Ledningsnet > Ø 500 mm","kr./m.",{"$f":"10641*(1+D203)","v":11034.716999999999},75]
[null,"Skelbrønd, Konstruktioner","kr./stk.",{"$f":"13540*(1+D203)","v":14040.98},50]
[null,"Skelbrønd, Mek./EL","kr./stk.",{"$f":"20310*(1+D203)","v":21061.469999999998},15]
[null,"Inspektionsbrønd, Konstruktioner","kr./stk.",{"$f":"13540*(1+D203)","v":14040.98},50]
[null,"Inspektionsbrønd, Mek./EL","kr./stk.",{"$f":"16925*(1+D203)","v":17551.224999999999},15]
[null,"Stik på ledningsnet, Konstruktioner","kr./stk.",{"$f":"7555*(1+D203)","v":7834.5349999999999},75]
[null,"Stik på ledningsnet, Mek./EL","kr./stk.",{"$f":"7555*(1+D203)","v":7834.5349999999999},75]
[null,"Ventiler"]
[null,"Ventiler på ledningsnet ≤ Ø50 mm","kr./stk.",{"$f":"7732*(1+D203)","v":8018.0839999999998},75]
[null,"Ventiler på Ø 50mm < Ledningsnet ≤ Ø110 mm","kr./stk.",{"$f":"8980*(1+D203)","v":9312.2599999999984},75]
[null,"Ventiler på Ø110 mm < Ledningsnet ≤ Ø 250 mm","kr./stk.",{"$f":"21736*(1+D203)","v":22540.232},75]
[null,"Ventiler på Ø 250 mm < Ledningsnet ≤ Ø 500mm","kr./stk.",{"$f":"78299*(1+D203)","v":81196.062999999995},75]
[null,"Ventiler på ledningsnet > Ø 500 mm","kr./stk.",{"$f":"223733*(1+D203)","v":232011.12099999998},75]
[null,"Pumpestationer, bygværker og bassiner"]
[null,"Pumpestation (inkl. evt. hydrofor)/trykforøger, Konstruktioner","kr/m³/h ","Variabel",50]
[null,"Pumpestation (inkl. evt. hydrofor)/trykforøger, Mek./EL","kr/m³/h ","Variabel",25]
[null,"Pumpestation (inkl. evt. hydrofor)/trykforøger, SRO","kr/m³/h ","Variabel",10]
[null,"Beholderanlæg - højdebeholder","kr/m³/h ","Variabel",50]
[null,"Beholderanlæg - vandtårn","kr/m³/h ","Variabel",50]
[null,"Andre: "]
[null,"Afregningsmålere, mekaniske, ","kr./stk.",{"$f":"1300*(1+D203)","v":1348.1},8]
[null,"Afregningsmålere, elektroniske med maksimal gennemstrømning ≤ 4 m3/t","kr./stk.",{"$f":"1450*(1+D203)","v":1503.6499999999999},10]
[null,"Afregningsmålere, elektroniske med maksimal gennemstrømning > 4 m3/t ≤ 15 m3/t","kr./stk.",{"$f":"2076*(1+D203)","v":2152.8119999999999},10]
[null,"Afregningsmålere, elektroniske med maksimal gennemstrømning > 15 m3/t ≤ 300 m3/t ","kr./stk.",{"$f":"20000*(1+D203)","v":20740},10]
[null,"Afregningsmålere, elektroniske med maksimal gennemstrømning > 300 m3/t","kr./stk.",{"$f":"26000*(1+D203)","v":26961.999999999996},10]
[null,"SRO-brønd/kvarterbrønd/sektionsbrønd, Konstruktioner","kr./stk.",{"$f":"78845*(1+D203)","v":81762.264999999999},50]
[null,"SRO-brønd/kvarterbrønd/sektionsbrønd, Mek./EL","kr./stk.",{"$f":"90108*(1+D203)","v":93441.995999999999},15]
[null,"SRO-brønd/kvarterbrønd/sektionsbrønd, SRO","kr./stk.",{"$f":"56318*(1+D203)","v":58401.765999999996},10]
[]
[]
[null,"Fællesfunktionsanlæg: "]
[null,"Andre"]
[null,"Arbejdsplads og kontor","kr./stk.",{"$f":"35000*(1+D203)","v":36295},5]
[null,"Køretøjer, personbil","kr./stk.",225000,5]
[null,"Køretøjer, små lastvogne (< 3.500 kg.)","kr./stk.",250000,5]
[null,"Køretøjer, store lastvogne (> 3.500 kg.)","kr./stk.",1300000,5]
[null,"Køretøjer, entreprenørmaskiner","kr./stk.",400000,5]
[null,"Øvrige"]
[null,"Solcelleanlæg ekskl. Inverter","kWp",5400,25]
[null,"Inverter til solcelleanlæg","kWp",600,10]
[]
[]
[null,"Regionstillæg",null,3.6999999999999998E-2]

{"sheet":"Variable priser","index":4,"n_rows":110,"n_cols":12,"rows_kept":110,"cut":false,"hidden":false,"merged":[[0,0,0,12]]}
["Til bestemmelse af diverse variable priser"]
["Udpumpningsanlæg",null,0,10,20,30,45,300,"m³/time"]
[null,null,0,44147.303999999996,62958.911999999997,77148.072,90254.76,292560,"kr"]
[null,null,4414.7303999999995,1881.1608000000001,1418.9160000000004,873.77919999999961,793.35388235294113,793.35388235294113,"kr/m³"]
[]
["Beluftningsanlæg",null,0,10,50,100,200,500,null,null,"Anlæg","Mekn/El"]
["Iltningstrappe",null,0,58570.511999999995,266229.59999999998,439278.84,718819.92,1331148,"kr",null,0.8,0.2]
[null,null,5857.0511999999999,5191.4771999999994,3460.9847999999988,2795.4108000000015,2041.0935999999999,2041.0935999999999,"kr/m³/t"]
["Ikabelufter",null,0,87855.767999999982,399344.4,658918.26,1078229.8799999999,1996722,"kr",null,0.5,0.5]
[null,null,8785.5767999999989,7787.2158000000009,5191.4771999999975,4193.1162000000004,3061.6404000000002,3061.6404000000002,"kr/m³/t"]
["Bundbeluftning",null,0,52713.460799999993,239606.64,395350.95599999995,646937.92800000007,1198033.2,"kr"]
[null,null,5271.3460799999993,4672.3294799999985,3114.8863199999996,2515.8697200000011,1836.9842399999995,1836.9842399999995,"kr/m³/t"]
["Kompressorbeluftning",null,0,11714.1024,53245.919999999998,87855.767999999982,143763.984,266229.59999999998,"kr"]
[null,null,1171.4102399999999,1038.2954399999999,692.19695999999965,559.08216000000016,408.21871999999991,408.21871999999991,"kr/m³/t"]
["Rent ilt",null,0,11714.1024,53245.919999999998,87855.767999999982,143763.984,266229.59999999998,"kr"]
[null,null,1171.4102399999999,1038.2954399999999,692.19695999999965,559.08216000000016,408.21871999999991,408.21871999999991,"kr/m³/t"]
["Rislebakke",null,0,35142.307199999996,159737.76,263567.30399999995,431291.95200000005,798688.8,"kr",null,0.7,0.3]
[null,null,3514.2307199999996,3114.8863199999996,2076.5908799999993,1677.2464800000009,1224.65616,1224.65616,"kr/m³/t"]
[]
["pH Justering",null,0,50,100,200,500,"m³/time"]
["Kalkdoseringsanlæg",null,0,78552.36,133539.01199999999,213662.4192,427324.83840000001,"kr"]
[null,null,0,235657.08,400617.03599999996,640987.25760000001,1281974.5152,"kr"]
["Luddoseringsanlæg",null,4713.1415999999999,3299.1991199999993,2403.7022160000006,2136.6241920000002,2136.6241920000002,"kr/m³/time"]
[null,null,0,39276.18,66769.505999999994,106831.2096,213662.4192,"kr"]
[null,null,785.52359999999999,549.86651999999992,400.6170360000001,356.10403200000002,356.10403200000002,"kr/m³/time"]
[]
["Behandlingsanlæg"]
["Åbne filtre",null,0,50,100,200,500,"m³/time"]
["07-41,01 inkl. tillæg",null,null,544161.6]
["Skønnet inkl. tillæg",null,null,292560,null,null,null,"kr/m³/t",null,null,"Anlæg","Mekn/El"]
["Returskylning inkl. tillæg",null,null,null,null,null,null,null,null,null,0.4,0.6]
["07-61.01",null,null,714577.8]
[null,null,0,1551299.4,2637208.98,4219534.3679999998,8439068.7359999996,"kr"]
["Dobbelt filtrering",null,31025.987999999998,21718.191600000002,15823.253879999998,14065.11456,14065.11456,"kr/m³/time"]
[]
[null,null,0,1085909.58,1846046.2859999998,2953674.0575999999,5907348.1151999999,"kr "]
["Enkelt filtrering",null,21718.191600000002,15202.734119999996,11076.277716000001,9845.5801919999994,9845.5801919999994,"kr/m³/time"]
[]
["Behandlingsanlæg"]
["Lukkede filtre",null,0,30,100,200,500,"m³/t"]
["Enkelt filtrering inkl..rør mv.",null,0,516368.4,1290921,2323657.7999999998,4647315.5999999996,"kr "]
[null,null,17212.28,11065.037142857143,10327.368000000002,7745.5260000000007,7745.5260000000007,"kr/m³/time"]
[]
[null,null,0,30,100,200,500,"m³/t"]
["Dobbeltfiltrering ekskl. rør ",null,0,722915.76,1807289.4,3253120.92,6506241.8400000008,"kr"]
[null,null,24097.191999999999,15491.051999999998,14458.315200000005,10843.736400000002,10843.736400000002,"kr/m³/time"]
[]
["Rentvandsbeholdere",null,0,100,500,1000,3000,"m³"]
["In-situ støbt rentvandsbeholder ",null,0,520756.8,2343405.6,4218130.08,7500000,"kr"]
[null,null,5207.5679999999993,4556.6219999999994,3749.4489599999988,1640.9349600000005,1640.9349600000005,"kr/m³"]
[]
[null,null,0,120,500,1000,3000,"m³"]
["Element beholder ",null,0,509054.4,1883501.28,3390302.304,6600000,"kr"]
[null,null,4242.12,3616.9654736842108,3013.6020479999997,1604.8488480000001,1604.8488480000001,"kr/m³"]
["Vandtårne",null,0,100,500,1000,3000,"m³/time"]
["Skønnet inkl. tillæg",null,0,781135.2,3515108.4,6327195.1199999992,11250000,"kr"]
[null,null,7811.351999999998,6834.9329999999991,5624.1734399999996,2461.4024400000003,2461.4024400000003,"kr/m³"]
[]
["Skyllevandsbeholdere",null,0,100,200,500,1000,"m³"]
["Lukket skyllevandsbeholder 30 - 80 m³",null,0,520756.8,833210.88,1833063.936,3299515.0847999998,"kr "]
[null,null,5207.5679999999993,3124.5407999999998,3332.8435200000004,2932.9022975999997,2932.9022975999997,"kr/m³"]
[]
["Åbne beholder med faste side / bund",null,0,251601.6,402562.56,885637.6320000001,1594147.7376000001,"kr "]
[null,null,2516.0159999999996,1509.6096000000002,1610.2502400000003,1417.0202111999999,1417.0202111999999,"kr/m³"]
[]
["Jordbassin",null,0,37740.239999999998,60384.384000000005,132845.64480000001,239122.16064000002,"kr "]
[null,null,377.4024,226.44144000000009,241.53753600000002,212.55303168,212.55303168,"kr/m³"]
[]
["Udpumpningsanlæg"]
[]
["Udpumpningsanlæg",null,0,10,20,30,100,1000,"m³/time"]
[null,null,0,39349.32,51051.72,59974.8,149937,899622,"kr"]
[null,null,3934.9319999999998,1170.24,892.30800000000022,1285.1742857142858,832.98333333333335,832.98333333333335,"kr/m³"]
[]
["Frekvensomformere inkl. elinstallationer"]
[null,null,0,2.2000000000000002,4,5.5,"m³/time"]
[null,null,0,68605.320000000007,74456.52,77089.56,"kr"]
[null,null,31184.236363636359,3250.6666666666652,1755.3600000000054,1755.3600000000054,"kr/m³"]
[]
["Hydrofor"]
[null,null,0,2500,5000,"m³/time"]
["Hydrofor inkl. styring",null,0,200842.44,270032.88,"kr"]
[null,null,80.336975999999993,27.676176000000012,27.676176000000012,"kr/m³"]
[]
["Nødstrømsaggregat"]
[null,null,0,11.5,16,22,50,"kW"]
[null,null,0,134577.60000000001,155495.64000000001,174073.2,295924.44,"kr"]
[null,null,11702.4,4648.4533333333347,3096.26,4351.83,4351.83,"kr/m³"]
[]
["El + SRO Vandværk"]
[null,null,0,50,200,1000,"m³/time"]
["Eltavle + install inkl. tillæg",null,0,380328,665574,1663935,"Kr"]
[]
["Sum",null,null,380328,665574,1663935,"Kr"]
[null,null,7606.56,1901.64,1247.9512499999998,1247.9512499999998,"kr/m³"]
[]
["SRO inkl. tillæg",null,0,292560,351072,596822.4,"Kr"]
[null,null,5851.2,390.08,307.18800000000005,307.18800000000005,"kr/m³"]
[]
["Pumpestation / Trykforøgerstation"]
[null,null,null,null,null,null,null,null,"Anlæg","Mekn/El",null,"SRO"]
["Maskinanlæg pumpestation / trykforøger",null,null,null,null,null,null,null,0.25,0.65,null,0.1]
[null,null,0,30,50,250,"m³/time"]
[null,null,0,230391,296217,877680,"Kr","Inkl. El og styring"]
[null,null,7679.7,3291.3,2907.3149999999996,2907.3149999999996,"Kr/m³/time"]
[]
["Skyllevandsbehandling"]
[null,null,0,20,40,"m³/t",null,"Mekn/El","SRO"]
[null,null,0,515637,773455.5,"kr",null,0.85,0.15]
[null,null,25781.85,12890.924999999997,12890.924999999997,"kr/m³/time"]